program: Gaussian 09
title: 000243605
version: EM64L-G09RevD.01
frameworkgroup: C1[X(C6H10I2OS)]
method: RPBEPBE
basis: SDD
operation: Freq
keyword: #p
keyword: freq=noraman
keyword: PBEPBE/SDD
title: #p freq=noraman PBEPBE/SDD
converged: NO YES NO NO
title: Mulliken charges:
elementType: I I S O C C C C C C H H H H H H H H H H
charge: 0.042788 0.045636 0.188922 -0.275048 0.083247 -0.017296 -0.659116 -0.643642 -0.809617 -0.765474 0.246090 0.261333 0.271835 0.260006 0.280179 0.267293 0.297038 0.314106 0.300669 0.311051
chargesum: 0.00000
title: Mulliken charges with hydrogens summed into heavy atoms:
elementType: I I S O C C C C C C
charge: 0.042788 0.045636 0.188922 -0.275048 0.329337 0.244037 -0.127274 -0.096169 -0.198473 -0.153755
polarizability: 2.03563545e+02 1.77306555e+00 8.73547204e+01 1.29453726e+01 -3.21755048e+00 8.91747684e+01
1716.lowfreq: -3.5887 -0.0020 -0.0017 -0.0008 5.7148 19.4655 28.8113 49.8871 86.0516
frequency: 28.6776 49.7721 86.0093 113.1172 127.2769 151.2883 196.9599 223.1219 269.7073 336.6861 376.0195 407.1951 438.6327 544.1649 581.7066 623.8455 692.7633 708.4003 759.1238 808.7614 823.7906 851.9094 922.2164 953.0094 976.2977 991.8653 1079.9481 1102.6417 1110.3534 1117.9543 1190.8389 1207.6084 1211.1368 1212.3501 1241.6180 1268.9754 1315.4608 1328.3125 1337.0528 1342.5723 1417.5442 1425.8096 1429.5057 1442.1397 2993.7678 3022.7588 3027.9945 3040.3890 3061.2695 3068.9619 3108.9618 3112.5630 3155.1779 3158.9788
redmass: 13.0879 7.6340 7.3922 3.7191 6.7585 2.9602 4.0592 3.3904 5.0251 3.8728 3.4906 3.4330 2.7983 3.9462 5.1213 5.5075 4.1328 3.0245 3.7339 1.9965 1.6032 2.0632 2.1513 2.0775 2.1894 2.0959 2.0177 1.9497 1.2508 1.3121 1.4140 1.1774 1.2706 1.2050 1.2565 1.3615 1.2086 1.1619 1.3823 1.4349 1.0894 1.0920 1.1015 1.0967 1.0846 1.0600 1.0702 1.0738 1.0559 1.0561 1.1051 1.1062 1.1102 1.1102
irintensity: 0.1788 0.4892 0.4659 2.0560 0.4444 3.7102 1.4326 10.5361 2.9650 3.2088 1.5398 2.7324 5.2380 21.1128 12.6787 22.0017 19.8709 34.7935 12.2791 13.8643 9.5037 7.3843 26.0815 41.4243 40.8678 60.5052 20.1441 3.5103 3.5021 15.6331 18.8580 24.8693 11.4196 34.3375 2.0904 10.1357 3.6139 0.7333 10.8129 3.4781 3.8968 35.8499 8.6720 14.1750 12.7697 25.4895 3.8856 22.6669 6.5443 6.5311 5.6764 2.9129 0.5361 2.2577
temp: 298.150 k
press: 1.00000 atm
elementType: 53 53 16 8 6 6 6 6 6 6 1 1 1 1 1 1 1 1 1 1
symmnumber: 1
zpe: 398206.7 jmol-1
zpe.correction: 0.151669 hartree
zpe.thermalcorrener: 0.163319 hartree
zpe.thermalcorrenthalpy: 0.164263 hartree
zpe.thermalcorrgfe: 0.109506 hartree
zpe.sumelectzpe: -730.123128 hartree
zpe.sumelectthermal: -730.111478 hartree
zpe.sumelectthermalent: -730.110534 hartree
zpe.sumelectthermalfe: -730.165290 hartree
dipole: -0.3366 0.3317 1.3157
dipole: 1.3980
quadrupole: -105.8151 -100.0761 -98.1135
quadrupole: 0.1130 1.9781 3.5534
quadrupole: -4.4802 1.2588 3.2214 0.1130 1.9781 3.5534
hfenergy: -730.2747966 hartree
pointgroup: C01 [X(C6H10I2O1S1)]
dipole: -0.1873212 0.1667616 0.4895045 debye
dipolederiv: -0.3131622 0.0236815 -0.0780487 0.0292442 -0.0848277 0.0167359 -0.1705804 0.0216665 -0.1739752 -0.4594655 0.1701188 0.010409 0.1150988 -0.1424045 -0.0090147 0.0013012 -0.0013597 -0.087671 -0.1959483 -0.0162268 -0.0657311 0.0175162 -0.2771237 -0.0242207 -0.0378924 0.0075829 -0.0763542 -1.3904277 0.2100231 -0.2756614 0.2494729 -0.5891938 -0.0053291 -0.0975406 -0.0255638 -0.3790202 0.6993841 -0.1184325 0.252595 0.008085 0.4304567 -0.0037938 0.1950611 -0.0791043 0.1931567 0.6556569 -0.0317946 0.0503823 -0.221671 0.4802483 0.0258959 -0.374366 0.2177026 0.1091732 0.177804 -0.0095291 -0.0510084 -0.0043916 -0.0468169 0.1017532 -0.1028862 0.0738882 0.0231231 -0.0891864 -0.0411773 0.1022372 -0.0609476 -0.0088833 -0.0355553 0.1445397 -0.0896148 0.2116987 0.3593906 -0.0579289 0.2624024 -0.2161523 -0.0209059 -0.0536471 0.5043539 0.0013525 0.3745363 0.6660127 -0.2609112 0.043369 -0.0965568 -0.0575634 -0.0709704 0.0601133 -0.0500227 -0.0396712 0.0277475 0.0436833 0.0331894 0.0179553 -0.0316343 -0.0508336 -0.0206598 -0.053843 -0.0908224 -0.0192737 -0.005733 -0.0374576 0.0465135 0.0043005 0.0782705 -0.0287823 0.041414 -0.0596675 0.0409438 0.0462186 -0.0611849 0.0504592 0.091377 0.0301749 -0.0687762 0.0559101 0.0164246 -0.028775 0.0202074 0.0551065 -0.0150914 0.0205092 -0.0360035 0.1086563 -0.109897 -0.0441533 0.0799984 0.0666914 0.0502524 0.0649266 -0.0336988 -0.0283766 -0.0200994 -0.0493635 -0.1069016 -0.0652332 -0.0295714 -0.026734 -0.0182244 0.1349665 0.0170817 -0.0183951 0.0331426 0.0790938 -0.0015609 -0.0058918 -0.092446 0.0683813 0.0497987 -0.0593427 -0.0205796 -0.0604427 -0.0643947 -0.0123568 0.0137096 -0.0788444 -0.0504588 -0.0200356 0.0412422 -0.0478111 0.0699438 0.0205217 -0.0506669 0.0467271 -0.0864194 -0.0052383 0.1302335 0.0679482 0.0051678 -0.0099833 -0.0016994 -0.0808814 -0.0638644 -0.0064073 0.021079 -0.0288026 -0.0020148 -0.010824 0.0065917 0.0966024 unknown
polarizability: 191.2753189|-21.7321573|91.9861417|30.1462096|-9.9259479|96.8315736 unknown
InChI: InChI=1S/C6H10I2OS/c7-1-5-3-10-4-6(2-8)9-5/h5-6H,1-4H2
charge 0 multiplicity 1
20 atoms
I  -4.127624 0.201257 -1.435137
I  3.698651 -1.684817 0.017033
S  0.862082 1.939038 -1.027974
O  -0.436711 -0.290499 0.90084
C  -1.223084 0.188753 -0.274444
C  1.049652 -0.225194 0.806691
C  -0.952536 1.670032 -0.570588
C  1.542538 1.21284 0.579022
C  -2.658154 -0.103407 0.186872
C  1.537051 -1.247227 -0.233609
H  -0.97983 -0.42106 -1.167841
H  1.357847 -0.555127 1.815691
H  -1.538883 2.015631 -1.437103
H  -1.187323 2.293806 0.309875
H  1.218619 1.859018 1.411596
H  2.640608 1.245035 0.493654
H  -2.972623 0.560017 1.005755
H  -2.762758 -1.157695 0.478845
H  1.441836 -0.883847 -1.267846
H  1.038043 -2.216656 -0.092331
