program: Gaussian 09
title: 000243601
version: EM64L-G09RevD.01
frameworkgroup: C1[X(C6H4O4)]
method: RPBEPBE
basis: SDD
operation: Freq
keyword: #p
keyword: freq=noraman
keyword: PBEPBE/SDD
title: #p freq=noraman PBEPBE/SDD
converged: YES YES YES YES
title: Mulliken charges:
elementType: O O O O C C C C C C H H H H
charge: -0.239491 -0.239492 -0.239492 -0.239492 0.204452 0.204454 -0.118770 -0.118770 -0.118771 -0.118770 0.256035 0.256036 0.256036 0.256035
chargesum: 0.00000
title: Mulliken charges with hydrogens summed into heavy atoms:
elementType: O O O O C C C C C C
charge: -0.239491 -0.239492 -0.239492 -0.239492 0.204452 0.204454 0.137265 0.137265 0.137265 0.137265
polarizability: 8.89093569e+01 5.65307195e-06 7.76487205e+01 8.82030634e-04 5.15443443e-04 3.11388343e+01
1716.lowfreq: -27.3189 -9.4095 -0.0004 0.0003 0.0008 9.5738 10.4656 18.5406 179.3208
frequency: -26.2509 -9.4095 179.3208 366.4032 373.4462 390.1346 456.6715 466.4965 480.2153 503.6225 515.0083 675.3195 727.9218 732.9205 788.2294 809.5920 833.3176 835.0738 908.3924 963.7320 975.0487 996.3741 1029.4301 1159.8331 1177.0114 1241.7949 1255.6782 1328.5009 1330.7518 1647.7475 1657.3679 1757.7814 3227.1374 3227.3203 3256.2812 3256.5656
redmass: 5.7739 4.0624 7.9501 6.5795 11.3579 7.2027 9.3336 5.7785 7.2065 11.9112 9.4357 11.3788 1.2691 1.2703 8.1761 8.1724 1.1863 1.1915 5.7619 5.3008 4.2936 7.6689 10.4552 2.7464 4.5180 1.2482 1.7003 1.2794 1.4139 6.9118 7.2770 11.3767 1.0878 1.0880 1.1048 1.1048
irintensity: 0.0000 21.2696 0.0000 14.2378 7.1214 0.0000 0.0000 0.0000 0.0000 1.7519 0.0000 0.0000 0.0000 157.2431 0.0000 1.4448 0.0000 0.0000 113.8560 126.4230 0.0000 0.0000 6.3288 181.6744 0.0000 0.0000 446.6818 0.0435 0.0000 125.0946 0.0000 0.0000 6.5664 0.0020 7.3808 0.0009
temp: 298.150 k
press: 1.00000 atm
elementType: 8 8 8 8 6 6 6 6 6 6 1 1 1 1
symmnumber: 1
zpe: 236444.6 jmol-1
zpe.correction: 0.090057 hartree
zpe.thermalcorrener: 0.096583 hartree
zpe.thermalcorrenthalpy: 0.097527 hartree
zpe.thermalcorrgfe: 0.058976 hartree
zpe.sumelectzpe: -531.056932 hartree
zpe.sumelectthermal: -531.050406 hartree
zpe.sumelectthermalent: -531.049462 hartree
zpe.sumelectthermalfe: -531.088013 hartree
dipole: 0.0000 0.0000 0.0003
dipole: 0.0003
quadrupole: -35.9526 -64.3110 -59.4281
quadrupole: 0.0000 0.0007 -0.0001
quadrupole: 17.2779 -11.0804 -6.1975 0.0000 0.0007 -0.0001
hfenergy: -531.1469888 hartree
pointgroup: C01 [X(C6H4O4)]
dipole: -0.0000012 -0.0000009 0.0001125 debye
dipolederiv: -1.2720581 0.1118678 0.0000048 -0.0992238 -0.4943476 -0.0000046 0.000025 0.0000081 -0.0998983 -1.2720566 -0.1118929 -0.0000394 0.0991986 -0.4943475 0.0000035 -0.0000519 -0.000043 -0.0998989 -1.2720598 -0.111891 0.0000069 0.0992021 -0.494348 -0.0000055 0.0000254 -0.0000136 -0.0998992 -1.272058 0.1118668 -0.0000411 -0.0992263 -0.4943466 -0.0000136 -0.0000521 0.0000384 -0.099899 1.2286192 0.0000144 -0.0000104 0.0000149 0.338239 -0.0000269 -0.0000237 -0.000009 0.0375577 1.2286215 0.0000136 -0.0000111 0.0000132 0.3382419 0.000038 -0.0000241 0.0000091 0.03756 0.6536653 -0.2707836 -0.0000109 -0.5012489 0.2361908 0.0000104 -0.0000137 0.0000081 -0.1329018 0.6536391 0.2707976 0.0000697 0.5012627 0.2362146 0.0000204 0.0000777 0.0000381 -0.132902 0.6536404 0.2707966 -0.0000072 0.501262 0.2362126 -0.0000033 -0.0000046 0.0000002 -0.1329029 0.6536648 -0.2707834 0.000066 -0.5012485 0.2361883 -0.0000134 0.0000681 -0.0000307 -0.132903 0.0040963 -0.0176304 0.0000018 -0.059555 0.0890242 -0.0000008 0.0000022 -0.0000024 0.2140216 0.0040945 0.0176274 -0.0000156 0.0595519 0.0890268 0.0000067 -0.0000155 0.0000062 0.2140218 0.0040947 0.0176273 0.0000023 0.0595516 0.089027 -0.0000019 0.0000037 -0.0000006 0.214022 0.0040966 -0.0176301 -0.000016 -0.0595544 0.0890243 -0.0000092 -0.0000166 -0.0000089 0.214022 unknown
polarizability: 88.9093569|0.0001802|77.6487205|0.000882|0.0005155|31.1388343 unknown
InChI: InChI=1S/C6H4O4/c1-2-8-6-5(7-1)9-3-4-10-6/h1-4H
charge 0 multiplicity 1
14 atoms
O  -1.16308 -1.481232 -0.000041
O  1.163098 -1.481196 -0.000085
O  -1.163126 1.481195 -0.00001
O  1.163051 1.481232 -0.000055
C  -0.000004 -0.674511 -0.000066
C  -0.000025 0.674511 -0.000048
C  -2.348923 -0.676893 -0.00002
C  2.348916 -0.67682 0.000035
C  -2.348945 0.676819 -0.000006
C  2.348895 0.676892 0.000049
H  -3.248622 -1.288533 -0.000016
H  3.248633 -1.288431 0.000112
H  -3.248662 1.288431 0.000011
H  3.248593 1.288532 0.000138
