program: Gaussian 09
title: 000243625
version: EM64L-G09RevD.01
frameworkgroup: C1[X(C18H18O4)]
method: RPBEPBE
basis: SDD
operation: Freq
keyword: #pfreq=noraman
keyword: PBEPBE/SDD
title: #p freq=noraman PBEPBE/SDD
converged: YES YES NO NO
title: Mulliken charges:
elementType: O O O O C C C C C C C C C C C C C C C C C C H H H H H H H H H H H H H H H H H H
charge: -0.268240 -0.287646 -0.276737 -0.247576 0.118936 -0.244833 0.410050 -0.326614 -0.303858 0.461110 -0.391195 -0.362195 -0.413434 -0.354924 -0.227134 -0.234059 0.321560 -0.231788 -0.239129 -0.239213 -0.240658 -0.761186 0.282958 0.223088 0.236035 0.233388 0.228358 0.271481 0.252171 0.240652 0.265187 0.224901 0.227141 0.225641 0.225447 0.227645 0.227083 0.256314 0.247095 0.244177
chargesum: 0.00000
title: Mulliken charges with hydrogens summed into heavy atoms:
elementType: O O O O C C C C C C C C C C C C C C C C C C
charge: -0.268240 -0.287646 -0.276737 -0.247576 0.118936 0.038125 0.410050 0.132508 0.157888 0.461110 -0.119713 -0.110024 -0.172782 -0.089737 -0.002233 -0.006918 0.321560 -0.006147 -0.013681 -0.011568 -0.013575 -0.013600
polarizability: 2.55997509e+02 -1.90910224e+01 1.47443633e+02 -3.07381488e-01 -3.28739903e+00 1.84375805e+02
1716.lowfreq: -15.7841 -8.8149 -4.1861 -0.0009 -0.0007 0.0004 11.2086 23.9538 30.3481
frequency: 9.7773 23.7506 29.6100 31.9754 50.4984 58.0539 60.6341 84.9049 101.3635 115.8510 161.4590 203.7309 221.1161 229.7462 240.0548 279.7361 293.2082 317.2785 327.2687 402.9495 403.1285 429.3000 461.4287 485.7227 527.5446 556.9192 598.0886 602.2496 611.4799 619.0428 620.0831 654.5010 675.0304 702.4963 704.8084 730.1814 762.6050 786.9272 827.6084 835.9923 854.9361 856.9281 865.9308 910.0022 916.4368 924.2326 939.2932 949.3838 963.1584 977.4113 979.4558 981.5947 990.3882 990.8761 995.0509 996.3962 997.5520 1008.6137 1027.5721 1033.8725 1043.4610 1078.9410 1082.5785 1091.6151 1128.0783 1164.7740 1171.4451 1171.8867 1185.4408 1186.8666 1195.3750 1199.4645 1215.3682 1230.0237 1280.3233 1301.4971 1314.9580 1320.9534 1329.9086 1346.2372 1382.3873 1383.1803 1388.6623 1434.1141 1441.7125 1453.2932 1455.1466 1468.0717 1476.2275 1479.1089 1484.4406 1592.7479 1593.9425 1611.4466 1614.4257 1657.6949 2998.8001 3007.3272 3010.5366 3034.5650 3094.3878 3097.2657 3109.7592 3122.8132 3123.8444 3132.4949 3135.0314 3142.7349 3145.1476 3148.3757 3158.8672 3161.7442 3171.7791 3174.1206
redmass: 7.7247 5.3530 3.8387 3.9943 4.0667 2.5936 2.6499 1.4451 4.2957 4.7862 3.1293 4.1523 4.2485 6.3022 4.9167 4.8652 3.8818 5.2688 6.7774 2.8468 2.8142 5.5310 4.0275 4.0103 3.6927 3.2158 6.5242 5.3575 4.0678 4.3739 4.0945 6.7028 5.1026 1.8610 1.7344 3.0235 1.9590 2.4204 4.5323 5.3618 1.2583 1.2590 2.4080 3.1906 2.4258 1.5828 2.2418 4.2262 4.2056 1.4148 2.9837 1.4365 6.0989 5.8342 1.3263 1.7429 1.5391 5.1466 2.1719 2.0632 1.6527 1.8321 1.6276 1.9245 2.7917 1.1503 1.0543 1.0560 1.1821 1.1762 2.5534 1.3582 2.1655 3.3244 1.3511 1.5679 1.3022 1.2821 1.2407 1.4132 7.1432 1.3410 5.0602 2.2058 2.1199 1.0609 1.0482 1.0922 1.1159 2.2567 2.2782 6.3473 6.1065 6.0729 6.0939 9.5451 1.0660 1.0369 1.0605 1.0836 1.1032 1.0969 1.1042 1.0847 1.0849 1.0885 1.0887 1.1013 1.0939 1.0938 1.0980 1.0981 1.0980 1.0969
irintensity: 0.2993 0.0417 0.6348 0.0528 0.1426 0.9075 11.2295 2.0996 2.2616 1.9624 0.1875 4.7814 0.5233 11.1168 2.3614 1.6335 0.5129 4.5003 7.9335 0.1049 0.4627 2.4337 1.6008 16.8185 7.7308 0.6425 3.6542 50.0081 1.0838 3.0493 2.6113 0.6223 20.9672 38.7587 68.2863 67.7942 26.8608 14.9664 9.5470 38.1043 0.3886 0.3021 6.3415 28.6091 9.5952 1.2014 22.6759 70.2650 22.3109 0.5065 10.0441 0.1872 3.2916 7.7948 0.4421 44.1334 39.1476 120.8864 8.3247 8.0776 10.2934 27.8599 8.6418 18.1665 46.0541 0.1283 0.3190 0.9909 13.0382 43.5220 274.4272 4.1584 6.5709 74.8940 8.3064 3.5526 3.0383 0.8335 0.2955 0.7681 3.1580 52.9125 6.4051 12.1396 7.4204 20.0567 15.7263 5.1274 3.2193 6.1999 11.6887 0.1013 2.6184 0.2027 1.3186 152.9587 56.6934 2.2981 48.4424 9.8625 24.7338 6.7976 27.1071 0.3990 0.5309 7.2120 11.5574 10.1356 31.4056 28.1754 29.6435 20.7570 6.9594 8.3037
temp: 298.150 k
press: 1.00000 atm
elementType: 8 8 8 8 6 6 6 6 6 6 6 6 6 6 6 6 6 6 6 6 6 6 1 1 1 1 1 1 1 1 1 1 1 1 1 1 1 1 1 1
symmnumber: 1
zpe: 830941.6 jmol-1
zpe.correction: 0.316489 hartree
zpe.thermalcorrener: 0.336694 hartree
zpe.thermalcorrenthalpy: 0.337639 hartree
zpe.thermalcorrgfe: 0.263414 hartree
zpe.sumelectzpe: -996.003330 hartree
zpe.sumelectthermal: -995.983125 hartree
zpe.sumelectthermalent: -995.982180 hartree
zpe.sumelectthermalfe: -996.056405 hartree
dipole: 0.4054 -2.3657 -1.9027
dipole: 3.0628
quadrupole: -113.2018 -121.9290 -124.9424
quadrupole: -5.7898 1.4628 -6.9987
quadrupole: 6.8226 -1.9046 -4.9180 -5.7898 1.4628 -6.9987
hfenergy: -996.319819 hartree
pointgroup: C01 [X(C18H18O4)]
dipole: -0.0311539 0.8061128 0.8951294 debye
polarizability: 243.0630838|39.4162864|162.2944318|6.6704672|-7.5052387|182.4594314 unknown
InChI: InChI=1S/C18H18O4/c1-14(19)22-17(15-8-4-2-5-9-15)18(20-12-13-21-18)16-10-6-3-7-11-16/h2-11,17H,12-13H2,1H3
charge 0 multiplicity 1
40 atoms
O  -0.275243 1.942656 -0.766077
O  -0.130595 1.190098 1.479164
O  0.243542 -1.576157 0.243343
O  -0.009634 -2.641392 -1.825658
C  -0.466327 0.760132 0.107837
C  0.551101 -0.290505 -0.442744
C  -1.910275 0.263363 0.068823
C  -0.32723 3.120907 0.129388
C  0.347816 2.593265 1.406354
C  2.006042 0.069597 -0.217203
C  -2.573911 -0.147984 1.248712
C  -2.581537 0.188215 -1.176334
C  2.754183 0.65768 -1.265711
C  2.625685 -0.157028 1.037822
C  -3.902568 -0.624558 1.18377
C  -3.90966 -0.287644 -1.239214
C  -0.030589 -2.685468 -0.577145
C  4.103976 1.024314 -1.063888
C  3.97551 0.206296 1.238569
C  -4.573805 -0.69705 -0.059365
C  4.718326 0.799991 0.189962
C  -0.357532 -3.887889 0.278249
H  0.342183 -0.413469 -1.521855
H  -1.378612 3.416372 0.310157
H  0.223657 3.929937 -0.3740
H  1.449983 2.607459 1.32396
H  0.0190 3.096914 2.329532
H  -2.045564 -0.079574 2.203787
H  -2.070955 0.519419 -2.08695
H  2.277723 0.831038 -2.237193
H  2.044053 -0.615917 1.842557
H  -4.414316 -0.93709 2.101275
H  -4.424457 -0.338864 -2.205059
H  4.675276 1.475627 -1.882843
H  4.449508 0.025675 2.210134
H  -5.604534 -1.06637 -0.108168
H  5.766704 1.078551 0.346869
H  -1.307367 -3.710877 0.813583
H  0.426602 -4.043955 1.03793
H  -0.454561 -4.780216 -0.35657
