program: Gaussian 09
title: 000243595
version: EM64L-G09RevD.01
frameworkgroup: C1[X(C5H6Cl6O2)]
method: RPBEPBE
basis: SDD
operation: Freq
keyword: #p
keyword: freq=noraman
keyword: PBEPBE/SDD
title: #p freq=noraman PBEPBE/SDD
converged: YES YES NO NO
title: Mulliken charges:
elementType: Cl Cl Cl Cl Cl Cl O O C C C C C H H H H H H
charge: 0.093812 0.114741 0.101489 0.093857 0.114818 0.101519 -0.245363 -0.245389 -0.100500 -0.100697 -0.200455 -0.611167 -0.611097 0.271112 0.251007 0.271100 0.251104 0.225067 0.225044
chargesum: 0.00000
title: Mulliken charges with hydrogens summed into heavy atoms:
elementType: Cl Cl Cl Cl Cl Cl O O C C C C C
charge: 0.093812 0.114741 0.101489 0.093857 0.114818 0.101519 -0.245363 -0.245389 0.421619 0.421506 0.249656 -0.611167 -0.611097
polarizability: 1.34147171e+02 -9.46510418e-03 1.10347652e+02 1.08644878e+01 -8.83868053e-03 1.10726119e+02
1716.lowfreq: -6.2331 -5.2052 -0.0025 0.0012 0.0016 10.1896 13.0837 18.0397 22.7012
frequency: 10.5806 17.9348 22.6943 51.2409 89.2842 108.6409 143.9116 180.0550 211.7469 225.3437 231.8627 236.7372 237.9174 280.7424 317.2005 330.2806 335.6025 349.1133 358.3347 371.7829 493.7694 557.4509 600.2954 639.6325 647.1833 724.2888 736.3131 892.7774 893.1748 959.1408 1033.9387 1035.2331 1048.2748 1091.8963 1100.5282 1126.1104 1222.2851 1222.8947 1242.8030 1360.8341 1369.7815 1378.7916 1449.5158 1454.7094 1456.1624 2980.6643 2981.3100 3003.0513 3051.6362 3053.1175 3083.3840
redmass: 13.3317 21.2730 28.4527 12.3785 13.6681 12.6730 7.1703 11.4237 10.4784 14.5133 15.1579 7.9942 10.4044 5.7655 8.6008 2.9580 3.4212 4.0966 12.3023 8.5209 8.3413 4.9151 6.0011 5.3460 5.6668 11.0789 9.8632 6.8670 5.8158 7.1088 1.7528 1.8621 5.8474 3.7286 5.6195 2.1869 1.0734 1.0696 1.0930 1.1911 1.2979 1.2454 1.0763 1.0832 1.0733 1.0562 1.0564 1.0534 1.1056 1.1060 1.1145
irintensity: 1.0117 0.1760 0.1178 0.0821 0.3113 0.1980 0.4755 8.0294 0.2563 0.1991 0.7854 4.5799 0.6225 15.5634 3.8424 9.4061 0.7873 0.4243 0.0578 8.9829 19.3952 68.8191 0.0029 175.8922 124.0647 232.7830 24.3215 9.2078 82.3282 421.9336 20.6922 3.5153 137.0048 60.4235 4.3960 13.6456 11.8157 19.6529 0.0032 6.6706 0.1155 10.1398 11.2787 1.7087 3.0791 48.7397 4.9145 65.7996 1.2300 8.3013 18.4009
temp: 298.150 k
press: 1.00000 atm
elementType: 17 17 17 17 17 17 8 8 6 6 6 6 6 1 1 1 1 1 1
symmnumber: 1
zpe: 287115.5 jmol-1
zpe.correction: 0.109357 hartree
zpe.thermalcorrener: 0.125163 hartree
zpe.thermalcorrenthalpy: 0.126108 hartree
zpe.thermalcorrgfe: 0.060914 hartree
zpe.sumelectzpe: -3103.848349 hartree
zpe.sumelectthermal: -3103.832542 hartree
zpe.sumelectthermalent: -3103.831598 hartree
zpe.sumelectthermalfe: -3103.896791 hartree
dipole: 0.0059 2.7489 0.0017
dipole: 2.7489
quadrupole: -128.5364 -112.4911 -116.5065
quadrupole: 0.0074 7.1420 0.0040
quadrupole: -9.3584 6.6869 2.6715 0.0074 7.1420 0.0040
hfenergy: -3103.9577055 hartree
pointgroup: C01 [X(C5H6Cl6O2)]
dipole: 0.0032888 -1.0814082 -0.0126828 debye
dipolederiv: -0.2828986 0.117049 0.1900574 0.1413938 -0.3039587 -0.2651915 0.1785075 -0.2305983 -0.5698746 -0.5270221 -0.2608243 -0.2107547 -0.226172 -0.3019929 -0.1380648 -0.2329792 -0.1367212 -0.2660241 -0.36773 -0.1621986 0.1862529 -0.2113382 -0.354683 0.2337128 0.2048116 0.230138 -0.3797665 -0.2830123 -0.1214031 0.1875255 -0.1456097 -0.3150738 0.2708123 0.1756681 0.236225 -0.5586459 -0.5272017 0.2644062 -0.2059638 0.2302226 -0.3064764 0.1371212 -0.2288731 0.1358293 -0.2610325 -0.3696624 0.1586323 0.1903424 0.2075089 -0.3439294 -0.2320192 0.2101335 -0.228516 -0.3886998 -1.1653186 0.219348 0.126302 0.5441384 -0.6919744 -0.0968616 0.0998432 -0.1231064 -0.3344721 -1.1646358 -0.2227927 0.1211918 -0.5469876 -0.6976469 0.0889198 0.0871875 0.1150809 -0.3295422 0.2956555 -0.1262911 -0.1681759 -0.2638616 0.2908963 0.0888819 -0.40464 0.1581555 0.1080909 0.295783 0.1299468 -0.1650919 0.2726336 0.2966717 -0.0850391 -0.3983568 -0.1545592 0.1023337 1.6724684 0.0013607 -0.0696979 -0.0031909 0.8259556 0.0050033 0.3470775 0.005338 0.3622988 1.2030871 0.3338082 -0.1338419 0.3247726 1.0013618 0.1552033 -0.1230908 0.1498412 1.2825126 1.2052034 -0.3301663 -0.1408986 -0.3216881 1.0061389 -0.1620462 -0.1302448 -0.1568001 1.2753441 0.0579755 -0.0439902 -0.0616492 0.0491047 0.0144681 -0.0397521 0.0068314 -0.067062 0.0382019 0.0022831 0.0240065 0.0600416 -0.0203366 -0.0365556 0.0873648 0.1193845 0.0195885 -0.0159528 0.0576124 0.0452631 -0.0609728 -0.0490131 0.0122758 0.0390874 0.0054668 0.0666307 0.0403634 0.0019781 -0.0250837 0.0598136 0.018001 -0.0342075 -0.0875106 0.1199118 -0.0197871 -0.0178096 -0.0522808 -0.0378026 0.0473043 -0.0267037 -0.0331503 0.0584421 -0.0187805 0.1591758 -0.0412485 -0.0522843 0.0367316 0.0482153 0.0271261 -0.0281194 -0.0580637 -0.0178582 -0.1588526 -0.046077 unknown
polarizability: 133.4698289|0.1579626|110.3482538|-11.5506377|-0.0314125|111.4028593 unknown
InChI: InChI=1S/C5H6Cl6O2/c6-4(7,8)1-12-3-13-2-5(9,10)11/h1-3H2
charge 0 multiplicity 1
19 atoms
Cl -3.404857 1.460914 1.58767
Cl -4.097001 -0.369323 -0.725516
Cl -1.886226 1.68024 -1.030042
Cl 3.393471 1.500407 -1.541702
Cl 4.085712 -0.3763 0.733864
Cl 1.869297 1.660996 1.077083
O  -1.151834 -1.28293 -0.397362
O  1.143328 -1.28972 0.38123
C  -1.698089 -0.500411 0.712639
C  1.689854 -0.483012 -0.711254
C  -0.00349 -2.089633 -0.01718
C  -2.707351 0.496798 0.144697
C  2.695593 0.504549 -0.120655
H  -0.897066 0.059882 1.232873
H  -2.222755 -1.158679 1.434643
H  0.888553 0.08606 -1.221425
H  2.217466 -1.124931 -1.445654
H  -0.209273 -2.718073 0.868256
H  0.203266 -2.697631 -0.916563
