program: Gaussian 09
title: 000243613
version: EM64L-G09RevD.01
frameworkgroup: C1[X(C10H12N4O6)]
method: RPBEPBE
basis: SDD
operation: Freq
keyword: #p
keyword: freq=noraman
keyword: PBEPBE/SDD
title: #p freq=noraman PBEPBE/SDD
converged: YES YES NO NO
title: Mulliken charges:
elementType: O O O O O O N N N N C C C C C C C C C C H H H H H H H H H H H H
charge: -0.301709 -0.441225 -0.180378 -0.260665 -0.206829 -0.201549 -0.419941 0.027282 0.022221 0.017457 0.317866 0.264046 0.447553 -0.495438 -0.293493 -0.367304 -0.248571 -0.277862 -0.320344 -0.217913 0.337070 0.298383 0.294773 0.352163 0.195712 0.212912 0.204317 0.229085 0.214033 0.204701 0.242497 0.351150
chargesum: 0.00000
title: Mulliken charges with hydrogens summed into heavy atoms:
elementType: O O O O O O N N N N C C C C C C C C C C
charge: -0.301709 -0.090075 -0.180378 -0.260665 -0.206829 -0.201549 -0.067779 0.027282 0.022221 0.017457 0.317866 0.264046 0.447553 -0.158367 0.004889 -0.072531 0.160054 0.155539 0.098391 0.024584
polarizability: 3.39959300e+02 -1.83872775e+01 1.90904722e+02 3.04266708e+01 8.15019275e+00 8.84337825e+01
1716.lowfreq: -6.9697 -2.2354 -0.0005 -0.0002 0.0003 0.3126 14.6754 26.6898 40.8229
frequency: 14.6412 26.6872 40.8082 50.9303 60.3921 71.4131 88.0974 103.1755 130.8634 153.8459 161.0456 162.8164 188.4419 214.5197 258.7254 292.5975 310.7739 333.2083 343.0450 370.6103 392.9080 441.4795 444.6204 461.2120 503.3011 512.1993 518.3855 551.9761 615.8497 653.1725 654.7978 678.6926 707.5504 728.1755 755.3236 811.4845 821.8893 827.2884 865.3444 870.9039 887.7634 899.5478 958.9147 964.4105 988.8873 1010.7924 1014.5635 1044.0631 1057.2903 1070.0950 1089.2109 1102.0325 1135.3644 1139.8444 1167.8430 1187.6016 1192.6212 1211.9485 1215.4701 1229.9675 1295.1878 1306.1055 1323.3155 1331.5634 1346.9822 1364.5023 1380.9341 1385.3051 1407.1105 1445.2218 1453.3135 1460.5517 1467.9986 1476.2278 1517.7213 1580.3711 1606.5508 1625.8314 2917.7658 2944.6529 2970.6094 3005.5120 3011.1785 3034.4273 3084.4179 3180.4830 3188.8757 3201.4793 3223.1199 3546.4581
redmass: 6.5358 7.1085 3.6592 8.3706 11.2166 9.8999 5.1200 3.6040 3.8429 5.3624 9.9459 5.6919 3.6897 3.6265 4.0084 5.9158 5.6378 4.4054 5.3200 7.4541 5.5234 3.6461 2.0961 1.9732 4.5348 4.5340 3.6241 3.3792 5.9093 7.7383 6.1091 10.5309 7.4301 5.0580 12.7801 1.6581 1.9945 2.6173 1.4280 2.6284 7.0713 1.5007 2.2061 1.4102 2.3234 1.3232 3.6008 2.6574 3.4078 3.0601 1.9361 3.8996 1.7147 1.6184 7.0451 1.2067 1.2142 1.5841 2.6802 1.7920 1.6390 1.5723 1.4776 1.2422 4.0584 5.1973 1.3515 1.8095 2.5073 5.3211 1.0957 1.0851 1.0787 2.9723 3.5525 5.3136 6.8278 7.1272 1.0628 1.0555 1.0705 1.0955 1.1040 1.0902 1.0962 1.0897 1.0920 1.0960 1.0796 1.0654
irintensity: 1.8134 2.7102 0.6545 0.1098 0.5259 0.4116 0.8968 2.3930 4.7033 1.7133 3.1990 8.4706 9.8120 13.3092 17.5387 2.2726 0.4667 5.6681 5.5062 1.0355 10.6226 18.3824 69.7981 89.7614 5.4038 4.4279 9.6898 15.5324 2.6343 16.5310 4.6540 10.1072 7.7745 1.5046 13.2918 38.5953 35.0110 27.8520 28.3609 18.9811 6.2526 20.7423 32.1845 24.7094 40.4463 0.3277 239.8751 21.0392 229.0557 18.1329 1.9688 50.4568 52.6632 18.2318 341.7722 25.0943 101.5127 178.8637 145.5948 134.7443 53.7967 20.5730 193.7516 15.7952 142.3577 56.1051 20.8863 22.8230 7.1633 0.9990 13.3498 5.9453 11.6159 64.1373 127.7112 143.0508 33.8315 352.4880 40.4058 79.0030 37.3314 31.7949 61.3816 23.8223 36.0045 2.9244 20.5201 0.1357 78.1302 9.9187
temp: 298.150 k
press: 1.00000 atm
elementType: 8 8 8 8 8 8 7 7 7 7 6 6 6 6 6 6 6 6 6 6 1 1 1 1 1 1 1 1 1 1 1 1
symmnumber: 1
zpe: 603188.2 jmol-1
zpe.correction: 0.229742 hartree
zpe.thermalcorrener: 0.249067 hartree
zpe.thermalcorrenthalpy: 0.250011 hartree
zpe.thermalcorrgfe: 0.178425 hartree
zpe.sumelectzpe: -1056.894954 hartree
zpe.sumelectthermal: -1056.875630 hartree
zpe.sumelectthermalent: -1056.874686 hartree
zpe.sumelectthermalfe: -1056.946271 hartree
dipole: -6.7934 -0.5258 -4.0595
dipole: 7.9314
quadrupole: -147.8719 -131.7614 -116.8407
quadrupole: -0.3696 16.6842 2.5998
quadrupole: -15.7139 0.3966 15.3173 -0.3696 16.6842 2.5998
hfenergy: -1057.1246967 hartree
pointgroup: C01 [X(C10H12N4O6)]
dipole: 2.55035 -1.1724726 1.3631458 debye
polarizability: 334.6522673|-11.5910809|167.9239829|49.7937864|41.5692087|116.7215544 unknown
InChI: InChI=1S/C10H12N4O6/c15-4-6-20-5-3-11-12-9-2-1-8(13(16)17)7-10(9)14(18)19/h1-3,7,12,15H,4-6H2
charge 0 multiplicity 1
32 atoms
O  4.932542 -0.334977 0.311345
O  6.747531 -0.039256 -1.866749
O  -2.868883 2.998796 1.081091
O  -0.663972 2.59696 1.477787
O  -4.812979 -2.089164 -2.032358
O  -5.663876 -0.108695 -1.272369
N  0.433041 0.379332 0.650874
N  -1.830367 2.24812 0.981587
N  1.483588 -0.515825 0.491108
N  -4.697082 -0.950798 -1.428834
C  -0.814176 0.064726 0.150781
C  -1.939358 0.958323 0.295149
C  -3.371064 -0.59814 -0.885806
C  -3.209206 0.623206 -0.22352
C  -1.033648 -1.173992 -0.535908
C  -2.286288 -1.504638 -1.046315
C  6.192164 -1.108797 0.287785
C  3.810291 -1.097335 0.874599
C  7.187612 -0.244429 -0.485806
C  2.645682 -0.155829 0.979794
H  -4.047926 1.313785 -0.104318
H  -0.180683 -1.845954 -0.644105
H  -2.457333 -2.448004 -1.571329
H  0.513114 1.300068 1.131287
H  6.542523 -1.30533 1.324395
H  6.029879 -2.074084 -0.236384
H  4.087511 -1.471588 1.887267
H  3.546503 -1.967311 0.239683
H  8.163575 -0.753561 -0.55201
H  7.32153 0.723623 0.041133
H  2.832339 0.814503 1.47502
H  5.815919 0.300161 -1.825776
