program: Gaussian 09
title: 000243596
version: EM64L-G09RevD.01
frameworkgroup: C1[X(C11H14N2O)]
method: RPBEPBE
basis: SDD
operation: Freq
keyword: #p
keyword: freq=noraman
keyword: PBEPBE/SDD
title: #p freq=noraman PBEPBE/SDD
converged: YES YES NO NO
title: Mulliken charges:
elementType: O N N C C C C C C C C C C C H H H H H H H H H H H H H H
charge: -0.237359 -0.118216 -0.416261 -0.385687 -0.416347 0.150118 -0.169498 -0.703440 0.471636 -0.428906 -0.376425 -0.195670 -0.227599 -0.276821 0.244613 0.257999 0.269117 0.241216 0.222968 0.293633 0.234929 0.234231 0.225072 0.219141 0.218694 0.221846 0.220551 0.226466
chargesum: 0.00000
title: Mulliken charges with hydrogens summed into heavy atoms:
elementType: O N N C C C C C C C C C C C
charge: -0.237359 -0.118216 -0.122627 0.116924 0.093985 0.150118 0.053471 -0.009209 0.471636 -0.209764 -0.157731 0.026176 -0.007048 -0.050356
polarizability: 1.63983686e+02 -1.65967167e+01 1.29163667e+02 -7.23750721e+00 -1.73311370e+01 1.10220647e+02
1716.lowfreq: -10.8979 -0.0003 0.0005 0.0007 4.5371 12.8601 21.6707 32.6091 49.3208
frequency: 20.8212 32.5391 49.3026 100.7975 143.8175 158.0655 169.5560 194.1168 240.8930 242.3910 285.1803 324.6860 381.1010 407.3472 454.0418 506.8241 535.2786 563.2897 597.6338 614.7950 692.4132 711.0043 728.8885 753.5905 802.0141 818.2992 820.0917 868.0143 875.5278 931.4673 940.9420 956.4538 974.3865 978.6088 1005.7517 1025.8058 1046.2777 1070.2939 1082.2824 1099.8451 1107.8867 1114.5868 1126.4758 1141.4437 1152.0823 1170.9947 1190.6629 1284.7097 1286.0796 1317.3752 1328.2085 1379.6766 1382.9254 1397.4047 1435.5881 1461.8075 1464.1109 1475.4346 1482.0705 1487.5466 1509.2012 1588.6851 1598.1670 1621.1972 2991.0606 3064.4989 3071.6879 3085.1961 3093.9449 3103.2970 3113.2803 3121.9472 3138.0636 3147.4001 3166.7990 3177.1048 3195.6262 3516.8220
redmass: 5.0932 4.6082 3.9120 3.1449 3.1157 4.0296 3.2043 4.0233 2.3236 1.2534 3.9356 3.1876 4.7067 2.9382 3.2207 2.6556 1.9531 4.0002 3.2350 6.3850 1.9048 4.7406 4.7965 1.7721 1.0508 3.0121 1.2405 2.7000 1.8383 4.1664 2.1645 1.3614 1.3835 4.3271 1.1321 2.1629 1.7663 2.3794 1.6050 1.3377 2.4924 1.5044 1.4929 1.4736 2.0961 1.0773 1.1160 1.8972 1.5805 1.3052 1.5458 1.4782 3.6054 3.0084 2.3342 1.0581 1.0821 1.1204 1.2559 1.8646 1.9086 5.2722 7.0372 6.2980 1.0348 1.0864 1.0507 1.0571 1.0986 1.1011 1.0868 1.0857 1.0921 1.0941 1.1008 1.1194 1.1179 1.0755
irintensity: 4.0467 0.3241 3.1527 3.8261 1.5971 5.6889 1.6127 3.5786 3.7376 1.0877 15.9610 3.5850 1.9925 0.3437 32.1334 34.3337 31.7088 39.9774 36.6476 0.5277 46.2238 2.4646 3.9730 86.8598 8.6247 6.0005 1.0552 9.4777 9.7348 4.5268 3.8593 0.0981 0.6948 3.3520 0.8672 5.8587 33.7442 41.0493 17.9628 1.5599 28.0325 31.9015 16.6266 5.0175 19.8846 2.8504 14.1719 32.2437 24.5104 18.9383 30.9058 34.0454 25.4532 153.3300 3.9252 16.2165 4.9271 13.9637 24.0222 45.9977 131.2883 61.2103 202.6287 185.7170 23.8646 3.2125 17.7126 25.0787 27.1757 21.7868 12.7968 5.6224 18.9804 51.8571 15.9495 2.5726 19.5273 20.8542
temp: 298.150 k
press: 1.00000 atm
elementType: 8 7 7 6 6 6 6 6 6 6 6 6 6 6 1 1 1 1 1 1 1 1 1 1 1 1 1 1
symmnumber: 1
zpe: 602292.8 jmol-1
zpe.correction: 0.229401 hartree
zpe.thermalcorrener: 0.243091 hartree
zpe.thermalcorrenthalpy: 0.244035 hartree
zpe.thermalcorrgfe: 0.187290 hartree
zpe.sumelectzpe: -611.210842 hartree
zpe.sumelectthermal: -611.197153 hartree
zpe.sumelectthermalent: -611.196209 hartree
zpe.sumelectthermalfe: -611.252953 hartree
dipole: -0.1264 2.1053 -1.5860
dipole: 2.6389
quadrupole: -88.0015 -75.7895 -83.1786
quadrupole: 4.1985 -8.0033 -1.8522
quadrupole: -5.6783 6.5337 -0.8554 4.1985 -8.0033 -1.8522
hfenergy: -611.4402433 hartree
pointgroup: C01 [X(C11H14N2O1)]
dipole: 0.1136353 0.8526523 -0.5813661 debye
polarizability: 157.4178208|-20.8628388|137.65224|-10.2112692|-14.8809541|108.2979397 unknown
InChI: InChI=1S/C11H14N2O/c1-9(11(14)13-7-8-13)12-10-5-3-2-4-6-10/h2-6,9,12H,7-8H2,1H3
charge 0 multiplicity 1
28 atoms
O  2.442295 -1.364231 1.398734
N  2.744467 0.468017 -0.017401
N  -0.173978 -1.472995 -0.069045
C  3.169036 1.581403 0.849469
C  2.18735 1.811345 -0.316238
C  2.147492 -0.739695 0.33775
C  1.14963 -1.329845 -0.697381
C  1.669541 -2.703349 -1.171397
C  -1.182483 -0.4950 -0.050877
C  -2.227221 -0.602481 0.917378
C  -1.241742 0.581337 -0.986415
C  -3.286733 0.323581 0.943625
C  -2.310938 1.503322 -0.947407
C  -3.341238 1.390239 0.013357
H  4.208857 1.906725 0.744574
H  2.772887 1.592944 1.871457
H  1.133798 1.990433 -0.069618
H  2.548579 2.293848 -1.230962
H  1.070108 -0.651042 -1.561616
H  -0.189518 -2.147738 0.700709
H  1.79356 -3.379503 -0.30659
H  0.954577 -3.151211 -1.882331
H  2.652709 -2.601293 -1.663731
H  -2.198487 -1.420865 1.648231
H  -0.477987 0.687308 -1.764071
H  -4.074063 0.21438 1.698543
H  -2.338009 2.315364 -1.683921
H  -4.165492 2.110201 0.036078
