program: Gaussian 09
title: 000243648
version: EM64L-G09RevD.01
frameworkgroup: C1[X(C18H36N3OP)]
method: RPBEPBE
basis: SDD
operation: Freq
keyword: #p
keyword: freq=noraman
keyword: PBEPBE/SDD
title: #p freq=noraman PBEPBE/SDD
converged: NO YES NO NO
title: Mulliken charges:
elementType: P O N N N C C C C C C C C C C C C C C C C C C H H H H H H H H H H H H H H H H H H H H H H H H H H H H H H H H H H H H
charge: 1.324133 -0.623963 -0.512339 -0.509527 -0.481305 -0.312323 -0.348962 -0.335569 -0.326126 -0.344766 -0.352223 -0.409392 -0.378818 -0.356773 -0.421218 -0.414381 -0.390768 -0.367719 -0.385514 -0.397965 -0.351507 -0.399562 -0.357778 0.192318 0.234751 0.238873 0.198254 0.234220 0.205295 0.236994 0.226199 0.208960 0.226948 0.224720 0.198822 0.197504 0.204208 0.233787 0.191845 0.194406 0.188920 0.194709 0.214185 0.199983 0.205176 0.246792 0.190488 0.184275 0.199260 0.198875 0.197855 0.201266 0.186836 0.188248 0.202321 0.194683 0.240425 0.196234 0.175728
chargesum: 0.00000
title: Mulliken charges with hydrogens summed into heavy atoms:
elementType: P O N N N C C C C C C C C C C C C C C C C C C
charge: 1.324133 -0.623963 -0.512339 -0.509527 -0.481305 0.114745 0.088165 0.103946 0.137068 0.091142 0.071319 -0.007679 0.046814 0.026553 -0.012324 -0.009222 0.046512 0.015816 0.011216 -0.009862 0.039062 0.035546 0.014184
polarizability: 2.61784100e+02 -1.62893071e+00 2.33483228e+02 1.25742269e+00 2.15291977e+00 2.04822045e+02
1716.lowfreq: -40.3286 -17.9054 -12.5220 -7.4619 0.0007 0.0012 0.0012 24.2256 37.4026
frequency: -38.5788 23.4328 37.2899 40.9584 52.2923 59.9137 80.4222 91.4546 106.6775 112.0072 131.7293 144.3783 178.5639 187.1107 202.9821 219.5556 226.9758 244.3509 259.5026 283.9373 294.9006 308.1300 326.6404 327.9450 340.5507 354.7498 362.1310 374.2559 390.3996 395.6217 419.1955 431.6266 476.0474 488.7960 495.8376 508.3305 535.1838 550.5218 614.8140 660.1965 673.4295 728.3766 742.6275 754.6650 759.3048 763.0609 801.7505 834.4987 838.7006 849.8522 855.5697 858.0208 872.3873 876.9575 883.6861 891.1911 897.7182 906.9254 918.1580 966.0240 967.0594 968.7880 989.2809 1003.1595 1004.6400 1015.4505 1027.1115 1031.1192 1038.8525 1052.6498 1058.0685 1059.7006 1097.8812 1099.2396 1101.6222 1127.6233 1132.3456 1141.8747 1167.2856 1169.4037 1177.0727 1179.7504 1183.9123 1188.5842 1212.9151 1213.5966 1216.8149 1232.6973 1240.2488 1240.5733 1259.5940 1261.8678 1265.5579 1275.5761 1278.9086 1284.2788 1303.1072 1317.9230 1326.4572 1329.2432 1333.0359 1333.2336 1339.2308 1340.4948 1342.6665 1346.2066 1348.1942 1349.5048 1349.8820 1350.8936 1358.0227 1362.0794 1363.8966 1365.7406 1367.3241 1370.8894 1380.7671 1440.3195 1443.7455 1448.8678 1452.5457 1454.5428 1456.4253 1460.6903 1462.2392 1464.9266 1465.7818 1467.8074 1469.4643 1470.8349 1474.2373 1476.1151 1476.6775 1485.8468 1490.1986 2896.5523 2945.0784 2949.9065 2950.5163 2952.3911 2953.1959 2953.8576 2959.3404 2960.6760 2965.3123 2966.2575 2968.0984 2968.9727 2969.3536 2972.9605 2976.3326 2978.1338 2980.4199 3009.6918 3010.3477 3016.6715 3018.5189 3018.6654 3021.0470 3026.2547 3026.8822 3028.0775 3030.7452 3032.9796 3037.8558 3039.6431 3044.2341 3045.2189 3050.5818 3051.6415 3052.1524
redmass: 3.4848 3.0294 3.2533 3.5221 3.6864 3.2080 2.5724 3.3379 3.6341 2.8939 2.4572 2.5170 2.6118 2.1187 3.2435 4.1335 3.7394 3.0518 2.9312 2.2081 2.5209 2.2222 2.2547 2.9458 3.1334 3.0096 2.5385 2.9033 2.3913 3.1069 2.5371 2.9562 2.8553 1.4947 1.8164 2.2096 3.0793 3.6260 2.3166 3.0119 2.9812 1.3074 1.3367 2.2604 2.4692 2.6093 1.6183 1.8394 2.6454 2.7284 1.6666 1.8164 2.0981 2.4766 2.5952 1.9194 2.1470 1.8049 1.8797 2.1624 2.1082 2.1805 5.2832 2.0766 2.0342 2.2066 1.7321 1.8119 1.8784 2.0918 2.0721 2.0917 1.9316 1.9784 1.9063 2.1843 2.1945 2.0242 2.2643 2.3211 1.4275 1.5468 1.6284 3.2817 1.4735 1.4808 1.3330 1.3154 1.2741 1.2481 1.3151 1.3236 1.2886 1.1813 1.1485 1.1805 1.2220 1.2787 1.4252 1.3215 1.3301 1.2787 1.3390 1.2973 1.4096 1.3465 1.3585 1.2904 1.4037 1.3526 1.3988 1.3483 1.2499 1.3100 1.2854 1.3098 1.2821 1.0750 1.0804 1.0882 1.0839 1.0831 1.0818 1.0862 1.0840 1.0784 1.0823 1.0887 1.0820 1.0886 1.0849 1.0838 1.0898 1.0752 1.0830 1.0697 1.0677 1.0638 1.0638 1.0675 1.0629 1.0612 1.0603 1.0608 1.0626 1.0653 1.0623 1.0629 1.0625 1.0618 1.0657 1.0661 1.0641 1.0987 1.0977 1.0994 1.0956 1.0967 1.0956 1.0970 1.0995 1.0977 1.0980 1.0991 1.0996 1.0947 1.0998 1.0959 1.0933 1.0991 1.1007
irintensity: 0.3289 0.1182 0.5110 0.1629 0.2813 0.2653 1.6354 0.8508 1.0891 0.6204 1.8252 2.4875 1.0721 0.1018 2.4379 2.4326 4.7001 6.9826 9.3515 0.5663 5.5205 0.4755 0.7326 5.9361 4.9529 5.8704 5.7033 3.6272 5.8894 2.1127 7.3671 12.3747 14.5054 2.5645 7.7392 7.9298 9.5916 23.6195 4.8376 89.7150 103.7895 5.6812 0.4275 5.7375 10.1140 5.7238 4.9660 15.8925 2.3784 10.7262 16.2103 50.0561 38.4236 50.6489 45.3592 18.1544 36.9110 16.0738 44.0279 7.1347 10.4188 1.9684 50.6484 16.6264 22.6654 20.2817 73.0129 40.7179 32.3005 6.4702 2.9177 20.6835 5.0651 1.8023 4.7117 3.0584 11.8996 16.9371 40.3144 26.1386 13.3180 20.7367 25.9258 27.1099 5.9749 12.4229 4.3747 7.4783 2.3976 2.7489 4.4169 10.7489 6.4257 4.5368 11.1366 17.0383 4.6361 8.9031 10.2687 1.5479 0.9501 2.5470 3.5109 1.0838 2.9862 1.7161 5.6707 1.6984 2.3199 0.8194 0.8389 2.2816 0.6299 3.7526 1.3614 5.7706 9.2008 4.6981 5.2636 7.1526 8.4353 9.4005 6.9511 6.2141 8.6389 11.2466 3.8887 6.7717 7.9247 20.4837 15.1912 17.2280 11.2847 15.8674 6.0845 63.5438 37.0594 9.2366 30.4045 46.7810 30.3480 20.7311 16.0707 36.1577 49.1036 46.8067 43.0284 20.1803 101.1240 51.5796 55.7138 39.8680 36.6409 32.1677 65.6076 52.6477 64.4210 23.4878 57.4940 32.5145 16.9594 114.3732 7.7644 37.5871 68.8383 42.2640 24.2575 103.4653 35.5095 30.9796 57.2670
temp: 298.150 k
press: 1.00000 atm
elementType: 15 8 7 7 7 6 6 6 6 6 6 6 6 6 6 6 6 6 6 6 6 6 6 1 1 1 1 1 1 1 1 1 1 1 1 1 1 1 1 1 1 1 1 1 1 1 1 1 1 1 1 1 1 1 1 1 1 1 1
symmnumber: 1
zpe: 1384354.8 jmol-1
zpe.correction: 0.527273 hartree
zpe.thermalcorrener: 0.551215 hartree
zpe.thermalcorrenthalpy: 0.552159 hartree
zpe.thermalcorrgfe: 0.474058 hartree
zpe.sumelectzpe: -1286.303966 hartree
zpe.sumelectthermal: -1286.280024 hartree
zpe.sumelectthermalent: -1286.279080 hartree
zpe.sumelectthermalfe: -1286.357180 hartree
dipole: 0.6772 -1.8157 -3.2358
dipole: 3.7717
quadrupole: -142.8568 -144.3146 -157.0588
quadrupole: 0.6985 2.9378 -4.7869
quadrupole: 5.2199 3.7621 -8.9820 0.6985 2.9378 -4.7869
hfenergy: -1286.8312387 hartree
pointgroup: C01 [X(C18H36N3O1P1)]
dipole: 0.5702122 -0.3006136 -1.3365825 debye
polarizability: 257.9570905|9.3183311|235.2856775|3.0940966|8.2341987|206.846605 unknown
InChI: InChI=1S/C18H36N3OP/c22-23(19-13-7-1-2-8-14-19,20-15-9-3-4-10-16-20)21-17-11-5-6-12-18-21/h1-18H2
charge 0 multiplicity 1
59 atoms
P  -0.195439 -0.249953 0.599368
O  -0.684097 -0.046697 2.118981
N  -1.030006 -1.590012 -0.155823
N  1.548238 -0.526492 0.516505
N  -0.526105 1.076616 -0.498323
C  -1.129487 -1.798069 -1.615254
C  -1.422334 -2.725753 0.710501
C  2.11169 -1.650734 -0.263174
C  2.327794 -0.019185 1.67978
C  0.502523 2.019065 -0.985242
C  -1.935833 1.548628 -0.556802
C  -2.572353 -1.887543 -2.169427
C  -2.915854 -2.751218 1.116625
C  2.993077 -1.191599 -1.451303
C  3.852558 0.057497 1.416207
C  0.98221 3.135058 -0.003681
C  -2.352336 2.573008 0.524992
C  -3.512014 -2.885579 -1.445416
C  -3.921387 -2.422702 -0.021415
C  4.34823 -0.561721 -1.051065
C  4.274711 0.564351 0.012881
C  -0.030017 3.554733 1.091793
C  -1.470936 3.843214 0.592387
H  -0.593492 -2.739855 -1.880745
H  -0.605939 -0.963854 -2.118149
H  -0.814453 -2.700527 1.635103
H  -1.159895 -3.659712 0.169372
H  1.276065 -2.262891 -0.647852
H  2.699472 -2.312574 0.408159
H  2.148847 -0.644007 2.581189
H  1.941696 0.986535 1.925883
H  0.064941 2.490619 -1.888286
H  1.38078 1.437142 -1.317197
H  -2.594095 0.662829 -0.478761
H  -2.087959 1.98342 -1.567303
H  -2.491637 -2.166046 -3.241355
H  -3.039768 -0.883714 -2.13748
H  -3.063684 -2.032588 1.944202
H  -3.126561 -3.762321 1.523321
H  2.404577 -0.469286 -2.051377
H  3.187437 -2.066563 -2.106848
H  4.314169 -0.936724 1.581844
H  4.273452 0.718753 2.199656
H  1.254383 4.021722 -0.613195
H  1.915116 2.808416 0.497489
H  -2.327593 2.06697 1.509136
H  -3.406825 2.858553 0.32575
H  -3.046843 -3.892712 -1.407458
H  -4.427782 -2.994335 -2.060252
H  -4.084338 -1.32728 -0.055468
H  -4.900484 -2.868375 0.244285
H  4.838571 -0.169419 -1.964957
H  5.015209 -1.358509 -0.659156
H  5.279165 1.026333 0.090081
H  3.5851 1.362758 -0.324723
H  0.376801 4.454547 1.595342
H  -0.086983 2.760617 1.862903
H  -1.95347 4.558992 1.287103
H  -1.440714 4.346075 -0.398148
