program: Gaussian 09
title: 000243597
version: EM64L-G09RevD.01
frameworkgroup: C1[X(C13H12FN5O2)]
method: RPBEPBE
basis: SDD
operation: Freq
keyword: #p
keyword: freq=noraman
keyword: PBEPBE/SDD
title: #p freq=noraman PBEPBE/SDD
converged: NO YES NO NO
title: Mulliken charges:
elementType: F O O N N N N N C C C C C C C C C C C C C H H H H H H H H H H H H
charge: -0.205225 -0.205718 -0.284258 -0.058614 -0.095816 -0.061121 -0.445634 0.041769 -0.405490 -0.389850 -0.102785 0.199088 0.198742 0.030450 -0.741157 0.421026 -0.411654 -0.280744 -0.345794 -0.370885 0.322353 0.249932 0.252286 0.254282 0.250412 0.358114 0.245808 0.243771 0.259196 0.247465 0.318128 0.259011 0.252909
chargesum: 0.00000
title: Mulliken charges with hydrogens summed into heavy atoms:
elementType: F O O N N N N N C C C C C C C C C C C C C
charge: -0.205225 -0.205718 -0.284258 -0.058614 -0.095816 -0.061121 -0.087520 0.041769 0.096728 0.114844 -0.102785 0.199088 0.198742 0.030450 0.007618 0.421026 -0.164189 0.037384 -0.086783 -0.117976 0.322353
polarizability: 3.19021699e+02 3.82919647e+00 2.68173848e+02 2.86691231e+00 -6.29124826e+00 8.25793764e+01
1716.lowfreq: -5.9089 -0.0005 -0.0002 0.0005 2.8545 5.7209 25.0999 32.5575 41.2063
frequency: 25.0380 32.5250 41.2049 62.1261 73.9636 92.5568 111.3110 147.5856 171.6505 201.2723 209.7929 234.4113 240.4029 253.4457 290.5507 312.8474 341.6457 359.6369 380.6707 388.9257 416.7692 450.9258 506.2872 518.1859 523.6415 542.4533 576.3283 596.0786 629.0636 650.3638 701.1837 705.6429 716.5170 743.2840 769.3384 780.4554 791.5195 810.1950 835.3457 839.6067 841.7340 917.4424 940.0082 948.2495 960.1411 980.8731 986.7821 1002.1648 1016.2919 1038.5779 1054.4682 1067.0894 1101.7036 1110.7574 1113.8233 1123.0611 1135.9741 1156.2976 1161.8877 1196.0595 1219.7103 1255.2050 1270.8937 1297.3099 1304.8849 1323.0287 1379.8880 1396.1523 1404.4171 1419.6246 1438.3131 1450.4640 1461.5118 1471.1638 1480.6828 1495.6575 1526.3489 1553.7485 1583.6341 1612.9606 1619.1940 3005.1454 3079.2261 3087.1115 3088.3270 3129.1558 3134.9703 3138.7333 3168.5093 3180.3132 3184.1726 3200.3195 3204.6231
redmass: 4.9506 4.7751 5.3255 5.1638 8.6267 3.6073 4.4438 3.3985 5.9851 7.1035 4.2403 1.1728 5.9751 6.4563 9.6422 7.0857 7.0308 3.7343 6.3478 5.4470 3.1286 7.5671 7.4043 2.6179 7.2020 7.8121 4.0939 5.4215 7.1171 11.9036 8.6473 8.5178 3.8087 6.9432 7.3630 6.9921 1.0626 1.3200 5.6069 5.3492 1.5095 1.1846 4.6491 1.3166 4.2621 1.3076 1.5650 2.7482 1.6666 1.6128 4.1418 2.5574 1.3390 1.3392 1.3337 1.5859 1.4695 1.5100 5.6498 1.9756 4.2463 5.6903 3.5768 1.4967 7.5072 6.4087 7.8649 1.2675 3.6857 3.1805 1.6111 1.0779 1.0754 2.2497 1.4137 2.8724 7.8890 6.0431 4.1463 3.6942 3.2362 1.0366 1.0494 1.0954 1.0592 1.1017 1.0901 1.0816 1.0915 1.0956 1.1189 1.1178 1.0948
irintensity: 0.4334 0.4964 0.3998 1.3968 0.9923 0.9144 13.5649 0.2997 7.6930 2.7937 3.9468 0.9407 5.3995 5.9482 9.5337 3.9276 8.5966 1.2572 0.4208 4.2004 0.0121 8.0117 31.8495 24.3040 4.4030 2.6427 1.6652 2.5017 1.3018 5.1920 2.8607 6.6828 0.6996 13.0119 14.3760 5.0874 46.5925 4.3939 17.6265 14.5226 64.6165 83.4952 2.2283 27.4719 18.5868 1.7591 6.3690 8.4764 1.9444 5.4484 11.6686 31.2421 12.5759 2.7942 5.5538 58.9564 4.0871 93.1923 391.9712 44.3369 17.1255 5.9650 1.2183 30.5059 258.7125 25.4020 3.8293 40.2030 18.7177 24.6112 128.5115 26.9239 3.9633 241.7299 49.9241 316.8226 1377.4488 86.5689 210.6174 58.0294 171.9858 1.7639 12.7305 5.0173 48.1159 20.0764 1.3885 120.7791 2.6404 3.2584 1.2370 21.3681 12.5335
temp: 298.150 k
press: 1.00000 atm
elementType: 9 8 8 7 7 7 7 7 6 6 6 6 6 6 6 6 6 6 6 6 6 1 1 1 1 1 1 1 1 1 1 1 1
symmnumber: 1
zpe: 630991.5 jmol-1
zpe.correction: 0.240332 hartree
zpe.thermalcorrener: 0.258605 hartree
zpe.thermalcorrenthalpy: 0.259549 hartree
zpe.thermalcorrgfe: 0.192071 hartree
zpe.sumelectzpe: -1025.018245 hartree
zpe.sumelectthermal: -1024.999972 hartree
zpe.sumelectthermalent: -1024.999028 hartree
zpe.sumelectthermalfe: -1025.066506 hartree
dipole: -1.2688 4.9746 1.2954
dipole: 5.2948
quadrupole: -131.1841 -115.7881 -121.7485
quadrupole: -15.3857 -2.5154 1.5541
quadrupole: -8.2772 7.1188 1.1584 -15.3857 -2.5154 1.5541
hfenergy: -1025.2585771 hartree
pointgroup: C01 [X(C13H12F1N5O2)]
dipole: 0.3066616 -1.9118954 0.7681071 debye
polarizability: 317.9265267|1.593241|266.8604938|18.1303127|-15.1508682|84.9879029 unknown
InChI: InChI=1S/C13H12FN5O2/c1-8-11(19(20)21)12(17-13(15-8)18-6-7-18)16-10-4-2-9(14)3-5-10/h2-5,16H,6-7H2,1H3
charge 0 multiplicity 1
33 atoms
F  -6.101782 -0.176844 -0.657739
O  3.071371 3.126674 -0.384171
O  0.809231 3.284149 -0.278459
N  1.595122 -2.967994 -0.000705
N  0.463427 -0.925686 -0.064702
N  2.897429 -1.035884 0.186927
N  -0.646783 1.152293 -0.253864
N  1.917232 2.556889 -0.258891
C  0.720941 -3.938916 0.673589
C  2.258941 -3.98655 0.823083
C  1.641533 -1.594563 0.054426
C  0.516616 0.438375 -0.143053
C  2.990843 0.3178 0.104946
C  1.814152 1.12518 -0.105037
C  4.390651 0.856755 0.279058
C  -1.998097 0.729162 -0.350475
C  -2.965877 1.772677 -0.42731
C  -2.428203 -0.626463 -0.380005
C  -4.337913 1.478536 -0.52976
C  -3.803016 -0.924929 -0.48429
C  -4.728872 0.128221 -0.555459
H  0.220562 -4.668515 0.029328
H  0.131603 -3.577407 1.524762
H  2.697172 -3.656649 1.771928
H  2.828704 -4.747515 0.281259
H  -0.458014 2.179686 -0.270036
H  4.436694 1.654237 1.039958
H  5.040271 0.014888 0.561857
H  4.759347 1.315821 -0.654393
H  -2.639305 2.818904 -0.408054
H  -1.682008 -1.418356 -0.321942
H  -5.088632 2.271156 -0.589447
H  -4.153038 -1.961035 -0.511028
