program: Gaussian 09
title: 000243593
version: EM64L-G09RevD.01
frameworkgroup: C1[X(C17H16N2O2)]
method: RPBEPBE
basis: SDD
operation: Freq
keyword: #p
keyword: freq=noraman
keyword: PBEPBE/SDD
title: #p freq=noraman PBEPBE/SDD
converged: YES YES NO NO
title: Mulliken charges:
elementType: O O N N C C C C C C C C C C C C C C C C C H H H H H H H H H H H H H H H H
charge: -0.232102 -0.250452 -0.177722 -0.407601 -0.164987 -0.590993 0.178365 0.242524 -0.576779 0.508463 0.496240 -0.445046 -0.373922 -0.393024 -0.366050 -0.221627 -0.205697 -0.249240 -0.236823 -0.227384 -0.242748 0.268718 0.221326 0.254102 0.329485 0.245218 0.249640 0.225013 0.255137 0.252836 0.263725 0.225227 0.233390 0.229060 0.228548 0.226143 0.229036
chargesum: 0.00000
title: Mulliken charges with hydrogens summed into heavy atoms:
elementType: O O N N C C C C C C C C C C C C C C C C C
charge: -0.232102 -0.250452 -0.177722 -0.078115 0.103732 -0.115565 0.178365 0.242524 -0.081921 0.508463 0.496240 -0.220033 -0.118785 -0.140189 -0.102325 0.003600 0.027692 -0.020179 -0.008275 -0.001241 -0.013712
polarizability: 1.85669205e+02 2.54618892e+01 1.80741380e+02 -1.04639341e+01 1.78507205e+01 1.75182320e+02
1716.lowfreq: -10.0151 -6.0062 -0.0006 -0.0005 0.0003 3.8289 23.4329 29.4145 35.8378
frequency: 23.1897 29.2281 35.7751 41.2016 47.2946 65.4009 108.1436 133.1233 167.2910 198.3836 205.3223 238.9371 288.9215 339.2521 344.6504 373.8183 403.4741 405.1388 434.9969 444.8431 472.8252 486.2339 552.9174 568.3250 602.1937 615.8199 616.6137 617.3564 641.3181 691.1274 704.3389 707.4558 723.4954 747.5958 755.3462 773.7560 819.8663 846.5828 859.0035 860.5683 879.4992 914.8794 930.2784 933.8509 953.8347 981.3002 984.0066 989.8442 990.3775 999.7580 1000.9210 1026.7773 1027.0478 1034.9863 1074.1195 1082.8699 1092.5445 1112.6985 1169.6908 1172.6918 1173.7309 1188.7710 1189.8533 1191.7992 1211.7488 1215.4613 1234.2462 1278.7954 1311.0651 1329.5253 1333.5433 1342.0669 1348.3953 1372.9390 1384.0594 1384.9662 1388.1645 1441.1867 1443.8959 1452.1443 1465.1577 1484.6015 1485.3628 1593.3766 1594.6411 1613.2344 1615.3398 1644.6478 1712.0739 2981.6261 2997.9754 3026.4125 3051.6276 3088.6961 3109.3730 3121.0329 3126.9643 3127.1780 3135.7083 3137.0314 3147.8024 3147.9554 3162.5631 3164.5026 3611.8846
redmass: 4.2581 4.9781 3.9901 4.8327 7.5011 5.1706 6.9722 6.9862 5.3174 5.3499 5.6479 5.4019 6.3660 1.9937 1.9786 6.4369 2.8268 2.8325 4.7336 1.2109 4.0218 3.6563 4.6980 5.7410 3.9142 6.5244 6.2659 6.4158 5.3427 5.8375 2.1254 1.9207 3.5071 2.7832 2.5967 2.4956 3.3538 3.4285 1.2751 1.2491 2.2492 2.3139 1.4961 1.5434 2.7016 1.3839 1.3967 5.7227 5.8246 1.3272 1.3387 2.2916 2.2725 2.2546 1.8597 2.4785 1.6064 2.1670 1.2771 1.0581 1.0887 2.0516 1.2230 1.1194 2.5632 2.5881 1.3003 1.7863 1.7468 1.3473 1.7484 1.3668 1.4517 1.9205 4.9525 6.1401 2.4642 2.1458 2.1226 1.1365 1.1128 2.2427 2.2950 5.9968 6.0767 5.9963 6.1417 10.8295 9.8112 1.0768 1.0667 1.0587 1.1024 1.1051 1.0879 1.0847 1.0862 1.0882 1.0912 1.0927 1.0961 1.0965 1.1016 1.1014 1.0800
irintensity: 0.1013 0.2875 0.0831 0.2653 0.2629 0.6481 4.1917 0.8691 3.2932 1.5064 1.5719 1.3408 10.1006 1.5941 3.0951 13.0156 0.0120 0.3613 9.4903 185.2624 10.1904 6.5740 8.5513 6.4162 12.0389 36.1335 0.6594 0.5248 16.3241 9.5057 67.9172 33.6237 83.3362 16.0277 30.7313 6.8680 10.2888 2.5251 1.3711 1.6893 6.5030 3.1396 4.8133 4.8839 8.8443 0.2262 1.2675 0.1066 0.5643 0.3412 0.9525 7.0023 3.1994 5.9454 26.3096 8.7681 29.7616 11.8450 30.3723 0.8108 3.1809 16.3545 7.6913 0.2819 3.1654 5.0742 4.4182 28.7056 47.1692 11.3957 88.0480 8.0620 14.5805 12.4947 21.8438 2.7699 86.5814 8.9760 7.0500 40.2192 19.3449 5.4821 19.6402 2.2289 4.0353 2.5402 3.2001 439.1686 184.9044 9.8631 49.0713 21.9476 8.6718 0.7348 11.3232 0.3539 1.4694 1.5459 10.2247 12.7483 12.3048 46.3060 20.5376 15.7892 46.7470
temp: 298.150 k
press: 1.00000 atm
elementType: 8 8 7 7 6 6 6 6 6 6 6 6 6 6 6 6 6 6 6 6 6 1 1 1 1 1 1 1 1 1 1 1 1 1 1 1 1
symmnumber: 1
zpe: 771030.5 jmol-1
zpe.correction: 0.293670 hartree
zpe.thermalcorrener: 0.311481 hartree
zpe.thermalcorrenthalpy: 0.312425 hartree
zpe.thermalcorrgfe: 0.245192 hartree
zpe.sumelectzpe: -915.919220 hartree
zpe.sumelectthermal: -915.901409 hartree
zpe.sumelectthermalent: -915.900465 hartree
zpe.sumelectthermalfe: -915.967698 hartree
dipole: -2.0472 1.0933 -0.1197
dipole: 2.3239
quadrupole: -105.6547 -116.9525 -132.9167
quadrupole: 7.8687 -4.5479 3.9428
quadrupole: 12.8533 1.5555 -14.4087 7.8687 -4.5479 3.9428
hfenergy: -916.2128901 hartree
pointgroup: C01 [X(C17H16N2O2)]
dipole: 0.6454908 -0.6360056 0.1216609 debye
polarizability: 198.4710274|22.2930403|160.9999604|3.1074047|-15.6340227|182.1219168 unknown
InChI: InChI=1S/C17H16N2O2/c20-16-15(11-13-7-3-1-4-8-13)18-17(21)19(16)12-14-9-5-2-6-10-14/h1-10,15,18H,11-12H2
charge 0 multiplicity 1
37 atoms
O  1.093416 1.412146 -2.340378
O  0.585065 2.092068 2.292956
N  0.52816 1.915258 -0.093254
N  2.357049 1.168626 0.990232
C  2.624747 0.876879 -0.425613
C  2.901763 -0.622311 -0.763887
C  1.343927 1.417338 -1.107322
C  1.117277 1.749853 1.209291
C  -0.818101 2.490455 -0.292275
C  1.900226 -1.598696 -0.163177
C  -1.918647 1.433426 -0.321494
C  2.25337 -2.391441 0.958461
C  0.591204 -1.723679 -0.698325
C  -2.38841 0.919267 -1.555696
C  -2.474233 0.949232 0.89001
C  1.322472 -3.283431 1.53877
C  -0.343917 -2.607259 -0.116147
C  0.01809 -3.3903 1.004577
C  -3.403074 -0.065011 -1.579855
C  -3.4876 -0.034582 0.866404
C  -3.956138 -0.542573 -0.368444
H  3.480478 1.473843 -0.801168
H  3.924171 -0.867417 -0.419147
H  2.906252 -0.685781 -1.868997
H  2.941547 0.867494 1.766916
H  -0.788508 3.049685 -1.243579
H  -0.977841 3.196488 0.541162
H  3.266888 -2.319732 1.374555
H  0.301871 -1.131742 -1.574589
H  -1.951132 1.284748 -2.492541
H  -2.101208 1.339101 1.844755
H  1.613685 -3.890952 2.403206
H  -1.354244 -2.67664 -0.534195
H  -0.707575 -4.07644 1.455489
H  -3.764813 -0.452635 -2.539048
H  -3.913287 -0.401158 1.807238
H  -4.748929 -1.299327 -0.386592
