program: Gaussian 09
title: 000243573
version: EM64L-G09RevD.01
frameworkgroup: C1[X(C11H8ClNO2)]
method: RPBEPBE
basis: SDD
operation: Freq
keyword: #p
keyword: freq=noraman
keyword: PBEPBE/SDD
title: #p freq=noraman PBEPBE/SDD
converged: YES YES NO NO
title: Mulliken charges:
elementType: Cl O O N C C C C C C C C C C C H H H H H H H H
charge: -0.059422 -0.171050 -0.164489 -0.375240 0.409560 0.367229 -0.354008 0.151569 0.141296 -0.253170 -0.791084 -0.219336 -0.242141 -0.247853 -0.246606 0.254367 0.276900 0.245936 0.223118 0.239089 0.277889 0.277544 0.259901
chargesum: 0.00000
title: Mulliken charges with hydrogens summed into heavy atoms:
elementType: Cl O O N C C C C C C C C C C C
charge: -0.059422 -0.171050 -0.164489 -0.375240 0.409560 0.367229 -0.099641 0.151569 0.141296 -0.253170 -0.045131 0.019752 0.035749 0.029691 0.013296
polarizability: 1.74065203e+02 1.55764576e+00 1.42844798e+02 -5.01113849e+00 -2.88646556e+00 8.72778510e+01
1716.lowfreq: -7.3715 -5.5346 -0.0014 -0.0012 0.0013 2.8397 41.6516 63.2315 83.2839
frequency: 41.6380 63.2144 83.2829 135.0633 141.1897 146.7843 214.6916 231.0455 265.3489 287.6147 290.9719 339.7030 377.8445 430.7663 490.2129 506.0336 528.6649 568.3783 584.1391 618.8818 635.9574 682.9145 711.2742 732.3849 737.7751 784.1979 794.8382 826.0948 900.2859 943.5949 946.9349 970.0179 1003.9611 1010.0998 1045.3150 1055.5615 1072.3702 1100.3354 1143.9997 1183.7377 1217.4614 1228.6225 1286.0277 1348.3465 1366.6697 1400.7683 1430.4111 1455.4693 1471.6076 1474.9329 1573.3448 1586.1595 1606.0339 1628.7784 1679.7387 2994.0140 3078.0999 3108.4664 3150.7795 3168.0853 3181.5653 3204.9718 3233.2550
redmass: 9.5530 5.2119 5.6699 2.3053 1.6108 7.1091 4.2107 8.7562 5.6287 4.2524 4.3152 3.9312 9.9006 7.6783 4.3549 3.2741 4.9155 5.9458 4.5703 7.8002 2.5906 7.1145 2.5311 6.6899 6.7925 1.5597 4.8324 2.0366 1.3907 1.3120 4.0319 1.3633 4.1055 1.7962 1.5371 1.3388 2.1956 4.7919 1.8184 1.7297 2.0859 2.2249 1.7132 4.6515 8.6702 1.2277 2.3561 1.9308 1.3432 1.1961 6.3695 6.9564 7.4579 11.3946 11.5422 1.0375 1.0969 1.0991 1.0870 1.0930 1.0999 1.0895 1.1107
irintensity: 0.2015 0.9725 4.2626 1.6003 1.9378 6.8892 2.0581 1.1605 3.6103 0.1537 3.3742 2.2486 8.6344 5.9647 1.0146 0.4693 1.3748 1.2768 1.1266 24.7261 4.1241 25.7733 43.4553 15.6915 6.8135 26.4142 2.4258 79.7175 3.2417 0.0999 8.2661 0.8239 11.4092 48.0189 3.7007 45.6713 5.6223 69.5639 4.6271 16.1934 0.3034 46.3278 1.4198 196.9145 30.5964 21.9784 41.9270 39.0431 72.4982 19.1122 38.3934 6.1734 12.6756 405.8257 2.1120 12.1426 9.9781 8.6914 4.3610 3.9942 7.0512 0.0268 0.8005
temp: 298.150 k
press: 1.00000 atm
elementType: 17 8 8 7 6 6 6 6 6 6 6 6 6 6 6 1 1 1 1 1 1 1 1
symmnumber: 1
zpe: 427669.3 jmol-1
zpe.correction: 0.162891 hartree
zpe.thermalcorrener: 0.175967 hartree
zpe.thermalcorrenthalpy: 0.176912 hartree
zpe.thermalcorrgfe: 0.122498 hartree
zpe.sumelectzpe: -1088.181399 hartree
zpe.sumelectthermal: -1088.168323 hartree
zpe.sumelectthermalent: -1088.167378 hartree
zpe.sumelectthermalfe: -1088.221792 hartree
dipole: 2.6562 0.3085 0.2511
dipole: 2.6858
quadrupole: -79.7098 -93.4095 -99.0864
quadrupole: -8.6847 -0.7099 10.7458
quadrupole: 11.0254 -2.6743 -8.3512 -8.6847 -0.7099 10.7458
hfenergy: -1088.3442901 hartree
pointgroup: C01 [X(C11H8Cl1N1O2)]
dipole: 1.0164364 0.2815618 -0.0645579 debye
dipolederiv: -0.5196242 -0.3043406 0.0872152 -0.3549376 -0.4153927 0.0897787 0.1036331 0.0939504 -0.0948263 -0.4280116 -0.0527868 0.2476529 0.0454676 -0.3328354 0.119921 -0.1720734 0.1549877 -0.921585 -0.4333796 0.0407861 -0.1585591 -0.0425283 -0.3390746 0.2152578 0.2666781 0.1617547 -0.9324923 -1.3620786 0.0720674 0.0548029 0.0736902 -0.2792278 0.2498138 0.0315603 0.2406353 -0.985136 0.9223879 -0.0657102 0.0226676 0.0183089 0.1518664 0.0222467 0.0303021 -0.0068802 -0.0421222 -0.292374 -0.2188606 0.0593885 -0.2151377 0.1267679 0.0071754 0.1138843 -0.0476791 0.01976 -0.102182 0.0651074 -0.0293997 0.0399309 -0.067485 -0.0037312 -0.0934726 -0.0292335 -0.086022 0.9198357 -0.0334273 -0.0734428 -0.2928421 0.3292182 -0.2868005 0.5289761 -0.2755973 1.3039064 1.049878 -0.0423439 -0.0712289 0.1772368 0.3030217 -0.323099 -0.6418707 -0.2519651 1.3172871 0.7023803 0.568095 -0.1695016 0.5700338 0.4702654 -0.1611562 -0.1599076 -0.1749589 -0.0208338 0.0071195 0.0620097 0.001179 0.0124081 -0.1446793 0.0591642 -0.0476707 0.1175671 0.0095817 0.0108313 -0.0289491 0.0130249 -0.0512809 0.0580986 -0.0555412 -0.0083575 -0.0629553 -0.1303766 -0.2595464 -0.0545432 0.2300718 -0.0002583 -0.1101638 -0.0545468 0.1533063 -0.0561715 -0.0002398 -0.2220893 0.0654301 -0.2454426 0.040019 -0.1398762 0.0041107 -0.1765352 -0.0104976 -0.0374681 -0.117744 -0.0989481 0.0234286 -0.1060725 -0.1608955 0.0090134 0.0213149 0.0210891 -0.1043231 0.0135188 -0.0870279 0.0233719 -0.079087 0.0397842 0.0104982 0.0241822 0.0398284 0.1287935 0.1237458 0.0422894 -0.0533686 0.0454124 0.0640833 -0.0155224 -0.0422757 0.0311776 -0.0341319 0.0138325 -0.1187108 -0.0433389 -0.0440944 0.0066768 -0.0234078 -0.0371319 -0.0531467 0.1086891 -0.0604061 0.0777163 0.0844723 0.0476993 0.0712544 0.0127282 0.1006334 -0.0274205 0.0316422 0.0467998 0.0416321 -0.0059409 0.0539231 -0.0663692 0.0551568 -0.0073091 0.0599146 0.144881 0.0226686 0.0264797 -0.028686 0.0484596 0.1628293 0.0322595 -0.0493707 0.0347092 0.0797955 0.0054477 0.0112511 0.0338104 -0.005411 0.1723913 0.0228936 0.0517669 0.0203266 0.087511 -0.0410103 0.0327841 -0.0021768 0.0190599 0.0997419 0.0137871 0.0097375 0.0205651 0.1577098 unknown
polarizability: 173.1612484|2.8031073|120.6342963|-6.0395178|-28.1061749|110.3923078 unknown
InChI: InChI=1S/C11H8ClNO2/c1-7-8(12)3-2-4-9(7)13-10(14)5-6-11(13)15/h2-6H,1H3
charge 0 multiplicity 1
23 atoms
Cl -3.868435 -1.617812 0.492458
O  1.344003 -0.559379 2.231884
O  1.704074 0.729362 -2.28812
N  1.102398 0.108691 -0.053861
C  -0.315128 0.360554 -0.101792
C  -1.231891 -0.69981 0.165333
C  -0.749483 1.66624 -0.424344
C  1.830403 -0.314538 1.103778
C  2.010929 0.330143 -1.141722
C  -2.603388 -0.345714 0.12821
C  -0.761088 -2.107747 0.455015
C  -2.126763 1.95597 -0.474774
C  3.276039 -0.387437 0.685422
C  3.381053 -0.012054 -0.617261
C  -3.068288 0.945253 -0.18415
H  -0.00872 2.442629 -0.635463
H  -0.567193 -2.238951 1.5353
H  -1.519557 -2.847263 0.153767
H  0.178372 -2.327779 -0.08051
H  -2.470273 2.963736 -0.726896
H  4.055797 -0.693554 1.382968
H  4.266951 0.060012 -1.248341
H  -4.141811 1.15255 -0.201703
