program: Gaussian 09
title: 000243563
version: EM64L-G09RevD.01
frameworkgroup: C1[X(C12H12ClN)]
method: RPBEPBE
basis: SDD
operation: Freq
keyword: #p
keyword: freq=noraman
keyword: PBEPBE/SDD
title: #p freq=noraman PBEPBE/SDD
converged: NO NO NO NO
title: Mulliken charges:
elementType: Cl N C C C C C C C C C C C C H H H H H H H H H H H H
charge: -0.046783 -0.018229 0.379089 -0.292082 0.374229 0.425739 -0.222283 -0.442195 -0.438907 0.146292 -0.308314 -0.817150 -0.796754 -0.785795 0.228541 0.238074 0.258938 0.223463 0.242637 0.242639 0.208252 0.243411 0.243388 0.252888 0.230470 0.230441
chargesum: 0.00000
title: Mulliken charges with hydrogens summed into heavy atoms:
elementType: Cl N C C C C C C C C C C C C
charge: -0.046783 -0.018229 0.379089 -0.292082 0.374229 0.425739 -0.222283 -0.213655 -0.200833 0.146292 -0.049376 -0.108411 -0.101703 -0.071995
polarizability: 1.84863245e+02 1.96845901e+00 1.98884449e+02 -5.42224944e-03 1.03846797e-02 7.05311060e+01
1716.lowfreq: -0.0032 -0.0028 -0.0015 8.7714 10.0267 13.3565 41.9665 97.1851 111.6780
frequency: 41.9583 97.1574 111.6523 144.6237 147.0922 177.1817 212.4148 222.1572 258.0689 290.0316 300.6438 315.3425 335.0098 404.7363 438.0518 468.5714 475.7412 525.8852 542.3382 573.0288 630.4510 654.8771 689.2348 736.6067 777.4774 802.8198 836.3901 878.2716 926.9495 948.9974 953.3610 990.3641 1003.9887 1038.9449 1044.4954 1046.4809 1051.3460 1100.1763 1171.0512 1193.6220 1248.5536 1267.7952 1294.8534 1313.0191 1346.4099 1375.8089 1388.5282 1400.8007 1405.0758 1438.5312 1451.1313 1463.2593 1467.2870 1468.2431 1475.4814 1477.6601 1485.8993 1569.5164 1589.0905 1603.6322 2979.8831 2987.0262 2988.1912 3057.2798 3073.6094 3078.0189 3082.2632 3087.3185 3116.6313 3118.9340 3141.9041 3160.2921
redmass: 4.4858 1.0873 2.3273 1.6324 1.7561 4.8074 7.6549 3.2151 1.0485 4.0864 4.3891 3.1406 3.3325 4.5380 5.1494 5.0004 3.7217 4.8910 3.7375 4.0271 5.8412 3.1845 5.2704 5.2964 8.3103 6.1760 1.2206 1.3410 4.4508 2.1442 1.3628 2.2236 1.5929 1.7710 1.5551 1.5463 1.5642 2.3223 1.9368 1.8568 3.5998 1.8612 4.3767 4.4589 4.8852 3.0554 1.2627 1.2397 1.2248 1.7971 1.0468 1.2018 1.0463 1.0464 2.2854 1.2073 1.8743 7.2062 7.1788 5.6211 1.0382 1.0359 1.0363 1.0972 1.0965 1.0974 1.1000 1.1010 1.0981 1.0877 1.0962 1.0933
irintensity: 0.4645 0.5628 0.6073 1.1255 1.5908 6.4590 0.6943 0.5397 0.4003 0.0348 5.5489 0.7576 0.0087 3.3411 1.6241 4.0135 0.0200 2.4443 1.6280 3.5111 5.9360 1.6772 1.5677 1.1420 51.6788 0.1515 28.6986 21.6652 10.7342 3.4452 0.0253 6.7954 4.8621 11.4538 0.6761 6.1141 14.1393 8.7197 0.6172 2.0533 19.5719 4.4611 23.8194 3.0321 16.1088 14.7736 25.1798 17.6407 20.0644 79.3133 13.4986 0.3046 14.6417 15.0686 5.1656 15.9918 62.8407 62.3790 67.8588 5.6938 22.5722 34.1547 25.7883 17.5326 13.3430 13.5881 18.3903 22.7960 8.4477 15.9086 31.4265 1.0649
temp: 298.150 k
press: 1.00000 atm
elementType: 17 7 6 6 6 6 6 6 6 6 6 6 6 6 1 1 1 1 1 1 1 1 1 1 1 1
symmnumber: 1
zpe: 538077.4 jmol-1
zpe.correction: 0.204943 hartree
zpe.thermalcorrener: 0.218122 hartree
zpe.thermalcorrenthalpy: 0.219066 hartree
zpe.thermalcorrgfe: 0.165328 hartree
zpe.sumelectzpe: -978.304881 hartree
zpe.sumelectthermal: -978.291702 hartree
zpe.sumelectthermalent: -978.290758 hartree
zpe.sumelectthermalfe: -978.344495 hartree
dipole: -0.0878 -0.1298 0.0000
dipole: 0.1567
quadrupole: -89.7889 -76.0624 -92.4276
quadrupole: 1.4060 -0.0002 0.0017
quadrupole: -3.6959 10.0306 -6.3346 1.4060 -0.0002 0.0017
hfenergy: -978.5098239 hartree
pointgroup: C01 [X(C12H12Cl1N1)]
dipole: -0.0527733 0.0318691 0.0000177 debye
dipolederiv: -0.1358224 -0.0213752 -0.0000048 0.0018309 -0.877177 -0.0000271 -0.0000036 -0.0000287 -0.0639146 -0.6421013 -0.0427244 -0.0000334 0.1008967 -0.4378286 0.000006 0.0000083 -0.0000032 -0.2135326 -0.0581137 -0.111044 -0.0000103 0.2296148 -0.5838964 -0.0000172 0.0000111 -0.0000418 0.0591911 0.319431 0.1828531 0.0000116 -0.3427321 0.0777508 -0.0000305 -0.0000446 0.0000075 0.022005 -0.0053139 0.0187836 0.0000049 0.1890764 0.3147719 0.0000518 0.0000205 0.0000312 -0.0463461 -0.1908823 0.0698005 -0.0000108 0.0967153 0.3736158 0.0000076 0.0000039 -0.0000567 -0.0258914 0.4295529 0.1114928 0.000033 -0.1110067 1.2984846 0.0000399 0.0000082 0.0000532 -0.0523133 0.0834051 0.1621189 0.0000211 -0.0270105 -0.1176807 -0.0000042 0.0000085 0.0000187 -0.1574767 0.0621717 -0.1898107 0.0000075 -0.045225 0.0149353 0.0000122 0.0000111 0.0000131 -0.1583304 0.7713654 0.0791054 0.0000924 0.295938 0.4660259 0.0000597 0.0002622 0.0000701 0.0255331 -0.4116755 -0.238615 -0.0000077 -0.306363 -0.4571837 -0.0000497 -0.0000379 -0.0000605 -0.1155932 0.0571966 0.0141659 0.0000059 -0.0809578 -0.1776709 -0.000028 -0.0000009 -0.0000139 0.0500947 0.0644052 -0.1748937 -0.0000362 -0.0836088 -0.1290668 0.0000043 -0.0000275 0.0001047 0.0336726 -0.3071482 -0.0731963 -0.0000718 -0.0421602 -0.0066011 0.0000209 -0.0003968 -0.0000284 0.0544127 -0.1160088 -0.0613864 -0.0000214 -0.0894772 0.0526041 -0.0000157 -0.0000229 -0.0000175 0.1460418 -0.0198474 0.1060846 -0.0000043 0.1192925 -0.0335902 -0.0000114 0.0000029 -0.0000183 0.1498356 0.0129469 0.0689618 -0.0000076 0.0815177 0.0533937 0.0000039 0.0000079 0.0000092 0.1606395 -0.1882392 -0.0686471 -0.0000474 0.0681268 0.0902757 0.0000086 -0.0000353 -0.0000121 0.1076593 0.0888053 0.0201204 0.076558 -0.0177578 -0.0107491 -0.0638988 0.0388542 -0.0883034 -0.0291412 0.0888387 0.0201063 -0.0765167 -0.0177711 -0.0107805 0.0639063 -0.0388238 0.0883152 -0.0291495 -0.1047214 0.1900881 0.0000841 0.0644059 -0.0196692 -0.0000397 0.0000476 -0.0000666 0.1038743 0.0589984 -0.0536543 -0.1000362 -0.0185838 0.033085 -0.0152082 -0.0822052 -0.070109 -0.028922 0.0590822 -0.0536493 0.0999905 -0.0185977 0.0329717 0.0152559 0.0821753 0.0701396 -0.0290472 0.1020104 0.0463583 -0.0000359 -0.061355 -0.0923133 0.0001448 0.0000838 0.0001456 0.1151411 -0.0091356 -0.0005872 -0.0708068 0.0074559 0.0732502 0.0822053 -0.1260177 0.0463077 -0.0393781 -0.0091999 -0.0004562 0.0708425 0.0077357 0.0730428 -0.0823965 0.1261106 -0.0464557 -0.0390647 unknown
polarizability: 199.0489935|-1.2412289|184.6987009|0.0100935|0.0059468|70.531106 unknown
InChI: InChI=1S/C12H12ClN/c1-7-4-5-8(2)12-11(7)10(13)6-9(3)14-12/h4-6H,1-3H3
charge 0 multiplicity 1
26 atoms
Cl 0.730159 -3.333449 -0.000214
N  1.289639 1.282047 -0.000001
C  -0.335783 -0.64616 -0.000191
C  -0.008217 0.785926 -0.000088
C  -1.729367 -1.050905 -0.000328
C  -1.052836 1.783211 -0.000084
C  0.825686 -1.502973 -0.00015
C  -2.701643 -0.038796 -0.000321
C  -2.380248 1.347684 -0.000187
C  2.325296 0.423803 0.000018
C  2.121347 -0.993808 -0.000057
C  -2.223862 -2.491087 -0.000499
C  -0.69513 3.253557 0.000014
C  3.729455 0.99021 0.00017
H  -3.757973 -0.333051 -0.000408
H  -3.19162 2.084897 -0.000163
H  2.981008 -1.670148 -0.000028
H  -3.328026 -2.495605 -0.000667
H  -1.879193 -3.053794 -0.885518
H  -1.879458 -3.05393 0.884537
H  -1.607845 3.875521 0.000375
H  -0.081592 3.512535 0.881079
H  -0.082182 3.51278 -0.881403
H  3.682054 2.089997 -0.000579
H  4.295044 0.657347 0.891118
H  4.295785 0.65609 -0.889827
