program: Gaussian 09
title: 000243561
version: EM64L-G09RevD.01
frameworkgroup: C1[X(C7H8ClN3O)]
method: RPBEPBE
basis: SDD
operation: Freq
keyword: #p
keyword: freq=noraman
keyword: PBEPBE/SDD
title: #p freq=noraman PBEPBE/SDD
converged: YES YES NO NO
title: Mulliken charges:
elementType: Cl O N N N C C C C C C C H H H H H H H H
charge: -0.025485 -0.174349 -0.418770 0.003231 0.044957 0.278921 0.009596 -0.312526 -0.154365 0.213107 -0.736279 -0.799285 0.320568 0.253204 0.242283 0.260444 0.242596 0.245941 0.273634 0.232575
chargesum: 0.00000
title: Mulliken charges with hydrogens summed into heavy atoms:
elementType: Cl O N N N C C C C C C C
charge: -0.025485 -0.174349 -0.098202 0.003231 0.044957 0.278921 0.009596 -0.059323 -0.154365 0.213107 0.009045 -0.047135
polarizability: 1.64050898e+02 3.44334603e+00 1.26645065e+02 1.40096061e-01 -3.58787077e-01 5.32372724e+01
1716.lowfreq: -30.0653 -7.4807 -3.8764 -0.0022 -0.0020 -0.0019 2.3812 16.0314 41.8929
frequency: -29.9485 15.9944 41.8356 72.3476 111.4285 157.4445 172.5722 205.9018 232.0406 271.7245 315.2002 386.3072 449.8844 526.1057 563.5857 566.5402 575.5623 629.9833 663.7011 703.3257 757.5707 800.8228 856.3943 901.1219 929.7825 948.1983 977.9230 1031.3501 1050.7660 1056.2727 1129.9571 1190.8673 1234.4211 1292.8197 1364.8212 1376.3587 1387.3764 1407.7079 1433.7948 1455.5412 1456.4131 1463.9802 1468.8307 1518.1192 1562.5063 1674.4657 2987.0764 3001.0721 3072.6342 3081.8770 3137.8755 3139.9918 3172.7603 3524.9658
redmass: 1.0704 7.5848 1.0268 3.6006 5.4130 7.3850 3.6887 7.3136 5.3008 4.6211 3.9066 11.7738 4.1426 4.4783 2.9667 5.0951 4.0602 2.2159 1.7341 6.2870 3.2040 6.4475 1.7187 5.1780 7.8276 3.1733 1.6633 1.6881 1.6120 2.5006 1.7446 3.0081 5.6461 2.9398 3.3749 1.2261 1.9838 2.5246 1.6843 1.1891 1.0990 1.2875 1.0671 3.9738 4.0415 6.4194 1.0384 1.0379 1.0984 1.0965 1.0979 1.1001 1.0945 1.0764
irintensity: 0.5398 7.6474 0.7932 0.0135 4.3388 1.5027 7.2188 0.5283 1.6721 1.5946 3.0748 12.2858 2.1280 25.5853 0.8163 14.6332 0.8991 20.4369 54.9598 1.5574 0.9197 38.7038 51.2541 8.3984 33.0831 44.1944 11.6076 9.7830 7.1693 23.4976 66.9263 282.2301 122.8034 12.1707 50.2810 56.8220 87.8443 26.0542 177.0072 63.4118 37.6338 88.1791 26.6284 907.7006 139.7820 146.2664 6.5470 3.4784 14.0917 9.6762 6.6498 6.1586 2.5659 15.9562
temp: 298.150 k
press: 1.00000 atm
elementType: 17 8 7 7 7 6 6 6 6 6 6 6 1 1 1 1 1 1 1 1
symmnumber: 1
zpe: 379861.7 jmol-1
zpe.correction: 0.144682 hartree
zpe.thermalcorrener: 0.156295 hartree
zpe.thermalcorrenthalpy: 0.157239 hartree
zpe.thermalcorrgfe: 0.104314 hartree
zpe.sumelectzpe: -970.211278 hartree
zpe.sumelectthermal: -970.199665 hartree
zpe.sumelectthermalent: -970.198721 hartree
zpe.sumelectthermalfe: -970.251647 hartree
dipole: 2.2060 -4.0910 0.1351
dipole: 4.6499
quadrupole: -85.0247 -68.7511 -76.8243
quadrupole: -15.4231 0.4820 0.0264
quadrupole: -8.1580 8.1156 0.0424 -15.4231 0.4820 0.0264
hfenergy: -970.3559602 hartree
pointgroup: C01 [X(C7H8Cl1N3O1)]
dipole: -1.0477092 -1.4989847 -0.0452928 debye
dipolederiv: -0.6660092 0.4570679 0.0065405 0.4772764 -0.5292397 -0.0051249 0.0066238 -0.0053583 -0.0896026 -0.7162478 0.0289823 0.005903 0.5111406 -0.8125059 -0.0319533 0.0139774 -0.0237515 -0.2929666 -2.4036821 0.0862131 0.0322895 0.1535439 -0.3547311 -0.0010333 0.0347466 -0.0052212 -0.3746104 -0.8168601 -0.2867183 0.0052872 -0.5147921 -0.7214522 0.0073061 0.0024022 0.006052 -0.178967 -0.5960699 0.1206803 0.0053013 0.1984597 -1.3230168 0.0001268 0.0046005 -0.0014516 -0.1493473 1.9534637 0.166746 -0.0233077 0.3884547 0.5564206 -0.0112733 -0.0150701 -0.0073013 0.2210994 0.7422224 0.0949008 -0.0061994 0.2237941 1.2329133 -0.0019367 -0.0070114 0.0045416 0.0487016 -1.1480362 0.1691631 0.0128584 0.2939535 -0.2712939 -0.0036022 0.0141926 -0.0026667 -0.1470066 1.4232849 -0.5105522 -0.0173862 -0.5320335 1.2862055 0.0044809 -0.0155771 0.0052457 0.0442172 2.1625056 -0.0829493 -0.0222218 -0.8369759 1.1132911 0.0582943 -0.0134638 0.0501369 0.1910415 -0.0485799 -0.2230504 -0.0000407 -0.124382 -0.3403193 -0.0001617 -0.0030169 -0.0093158 0.0102848 -0.3936584 -0.1673609 -0.0012599 -0.2791362 -0.171236 -0.0243477 -0.0474308 -0.0409132 0.0501131 0.1727593 0.0333919 0.0035608 0.0257753 0.0957014 -0.0040592 -0.0023128 -0.0001854 0.3065208 0.0865192 -0.0567596 0.0011087 -0.0578662 -0.0344391 0.0013388 0.0004951 0.001561 0.1852498 0.0687955 -0.0031974 0.0998085 -0.0131143 0.0584804 0.0105413 0.0951046 0.0554236 -0.0133332 -0.0159635 0.120287 -0.0029438 0.0387317 0.0506233 0.0016805 -0.0008981 0.0034949 0.1246869 0.0741953 -0.0033193 -0.0970234 -0.0150251 0.0569749 -0.0121204 -0.0920086 -0.0525636 -0.0179635 0.0770971 -0.0100552 0.0327731 -0.0285889 0.0642412 -0.077402 -0.0081226 -0.0882714 -0.0541122 -0.0258253 0.0403435 0.020903 0.1030225 0.0501609 -0.0205071 0.0375674 -0.0090631 0.1292969 0.0700892 0.0261864 -0.0559511 -0.0122382 -0.0067786 0.109753 -0.0047983 0.1196075 0.0066972 unknown
polarizability: 162.7573958|-7.6127717|127.9208582|-1.2538941|0.7158826|53.2549824 unknown
InChI: InChI=1S/C7H8ClN3O/c1-4-9-6(8)3-7(10-4)11-5(2)12/h3,11H,1-2H3
charge 0 multiplicity 1
20 atoms
Cl 3.466882 -2.042473 -0.041361
O  -2.900239 1.148541 0.099778
N  -1.601567 -0.835247 0.015698
N  0.002086 0.948284 -0.005163
N  2.381013 0.448254 -0.030861
C  -0.268629 -0.389809 0.001362
C  1.314397 1.320835 -0.019735
C  0.769819 -1.369672 -0.009115
C  2.076277 -0.856858 -0.02581
C  -2.820646 -0.098533 0.053809
C  1.630624 2.791671 -0.023229
C  -4.042826 -1.021467 0.019564
H  -1.711208 -1.852541 -0.002767
H  0.572244 -2.444276 -0.003513
H  2.24862 3.04757 -0.902059
H  0.699445 3.375488 -0.037167
H  2.222715 3.05623 0.871215
H  -4.129664 -1.519879 -0.964181
H  -4.944109 -0.414174 0.183933
H  -3.991237 -1.803842 0.7994
