program: Gaussian 09
title: 000243590
version: EM64L-G09RevD.01
frameworkgroup: C1[X(C12H14Cl2N2O3S)]
method: RPBEPBE
basis: SDD
operation: Freq
keyword: #p
keyword: freq=noraman
keyword: PBEPBE/SDD
title: #p freq=noraman PBEPBE/SDD
converged: YES YES NO NO
title: Mulliken charges:
elementType: Cl Cl S O O O N N C C C C C C C C C C C C H H H H H H H H H H H H H H
charge: -0.062769 -0.064397 0.900399 -0.489343 -0.483236 -0.244477 -0.421144 -0.066581 -0.385261 -0.112937 0.274032 0.267264 -0.316598 -0.304184 -0.248661 -0.320717 -0.596595 -0.592132 -0.204624 -0.201648 0.259945 0.264490 0.231579 0.234682 0.229552 0.237284 0.276213 0.284395 0.323851 0.256383 0.259108 0.314481 0.252636 0.249011
chargesum: 0.00000
title: Mulliken charges with hydrogens summed into heavy atoms:
elementType: Cl Cl S O O O N N C C C C C C C C C C C C
charge: -0.062769 -0.064397 0.900399 -0.489343 -0.483236 -0.244477 -0.421144 -0.066581 0.139175 -0.112937 0.274032 0.267264 0.149663 0.162652 0.027551 -0.036322 -0.016361 -0.018542 0.048012 0.047363
polarizability: 2.53494769e+02 -4.52071597e+00 2.27423942e+02 2.19933166e+01 9.34722320e-01 1.34895953e+02
1716.lowfreq: -7.3528 -5.4306 -2.1572 -0.0017 -0.0015 -0.0005 8.8316 29.2069 36.3761
frequency: 8.4326 29.1705 36.3552 43.5684 61.5216 69.3543 84.7602 93.0014 102.0574 122.7235 144.5495 152.7211 174.3614 190.7621 203.6308 225.2768 252.7552 270.8689 296.0415 307.9423 324.9594 342.8907 412.0609 418.9501 434.5740 442.5144 471.8491 484.7841 495.5749 568.3797 642.0368 657.2275 670.5631 673.8633 677.8499 740.6010 772.2301 782.9861 784.7473 787.2613 821.4006 845.6592 862.2545 890.8782 948.2014 971.9591 988.2883 1002.5030 1005.5007 1011.0912 1019.0164 1020.1932 1041.1805 1044.0712 1111.3811 1121.2020 1129.2666 1151.7182 1177.2612 1225.7165 1241.2379 1256.3341 1262.3560 1273.1031 1281.0185 1296.5741 1342.7477 1352.6519 1371.3445 1380.3759 1384.9318 1396.2523 1419.9285 1430.5576 1448.0863 1449.3213 1456.0253 1462.3379 1469.0912 1575.3905 1591.0438 1612.4535 2981.1783 2986.1480 2990.9902 3047.7856 3050.4770 3052.7479 3058.6478 3063.7652 3143.5735 3149.2998 3156.0915 3160.3530 3170.5950 3181.2000
redmass: 11.2606 8.4302 4.9266 18.0675 4.8703 8.2473 7.2416 6.0731 2.8277 2.9330 6.2602 3.9864 6.0047 7.1819 4.6364 6.7951 8.7243 6.1257 7.5834 5.1328 5.4993 6.4805 12.3314 3.6197 12.2565 3.3009 2.1415 5.0179 4.6341 6.7757 6.5511 4.8654 5.8691 6.9734 6.7196 3.1525 1.4582 1.5809 1.2355 2.1658 10.8242 5.4796 6.6441 1.3484 19.1564 1.3907 3.1472 1.7511 3.8499 1.3664 1.8371 2.0306 3.6086 3.1427 1.6462 1.8010 1.3889 2.1150 1.1262 2.2022 1.7830 1.3676 1.2204 1.3482 1.6552 1.1572 1.3900 1.4386 1.2375 1.3986 1.3207 7.6755 1.1015 2.2264 1.6269 1.3846 1.0812 1.0914 1.1012 7.2778 9.0138 8.0780 1.0573 1.0600 1.0603 1.1036 1.0643 1.0982 1.1028 1.0572 1.1129 1.0869 1.1121 1.0906 1.0957 1.1008
irintensity: 0.3629 1.9930 0.0802 1.0457 1.0826 2.1374 2.0241 0.7653 0.4705 4.7059 1.2117 7.6260 7.7212 1.9221 2.3423 5.4352 18.9304 5.5494 10.9453 5.7781 5.4168 9.6238 68.2577 11.2450 33.3856 11.8008 7.2033 0.9606 14.7739 21.6179 3.1739 30.0919 85.4507 28.4489 22.6174 25.7782 6.9581 41.0566 7.2502 22.4544 113.2146 26.1399 79.1423 1.6228 88.2437 0.8329 32.8053 1.7969 5.1274 0.3647 24.5089 39.2145 5.3411 5.1150 53.3418 128.7300 36.8366 12.4681 8.1305 84.4606 146.1163 17.1518 13.1368 27.0379 82.7059 25.5544 15.7404 15.8758 4.8093 16.3453 11.6618 1.8274 23.2731 11.9290 36.2639 0.9602 5.9889 9.9438 23.2667 66.6380 107.7064 31.9593 13.6316 32.3357 38.9492 2.0016 9.3971 18.8326 20.6179 17.3068 10.7774 2.5308 6.8017 1.3681 0.5375 15.1834
temp: 298.150 k
press: 1.00000 atm
elementType: 17 17 16 8 8 8 7 7 6 6 6 6 6 6 6 6 6 6 6 6 1 1 1 1 1 1 1 1 1 1 1 1 1 1
symmnumber: 1
zpe: 650711.8 jmol-1
zpe.correction: 0.247843 hartree
zpe.thermalcorrener: 0.268833 hartree
zpe.thermalcorrenthalpy: 0.269777 hartree
zpe.thermalcorrgfe: 0.193948 hartree
zpe.sumelectzpe: -2117.358806 hartree
zpe.sumelectthermal: -2117.337816 hartree
zpe.sumelectthermalent: -2117.336872 hartree
zpe.sumelectthermalfe: -2117.412701 hartree
dipole: -6.1108 1.7452 -0.0614
dipole: 6.3554
quadrupole: -116.4217 -166.8214 -141.8206
quadrupole: -4.1407 18.2682 -0.7829
quadrupole: 25.2662 -25.1335 -0.1327 -4.1407 18.2682 -0.7829
hfenergy: -2117.6066489 hartree
pointgroup: C01 [X(C12H14Cl2N2O3S1)]
dipole: 2.2599253 0.9518589 0.4886501 debye
polarizability: 254.766696|0.808634|189.7787081|12.5831147|48.0366234|171.2692605 unknown
InChI: InChI=1S/C12H14Cl2N2O3S/c13-5-7-15(8-6-14)9-16-12(17)10-3-1-2-4-11(10)20(16,18)19/h1-4H,5-9H2
charge 0 multiplicity 1
34 atoms
Cl -3.415736 -3.953059 -1.131232
Cl -4.077674 1.431184 2.874625
S  1.084128 -0.908297 -1.226954
O  0.608397 -2.389368 -0.76462
O  1.352747 -0.647101 -2.805532
O  -0.067813 2.315002 0.843372
N  -0.112312 0.438591 -0.568202
N  -2.604194 0.121432 -0.800143
C  -1.405168 0.721462 -1.304575
C  2.418639 -0.219028 -0.083269
C  1.91794 0.886502 0.62412
C  0.504528 1.305794 0.335312
C  -3.058193 -1.187663 -1.301289
C  -3.395994 0.817573 0.228242
C  3.707731 -0.736785 0.064198
C  2.76677 1.536953 1.543784
C  -2.673168 -2.374299 -0.392067
C  -2.871259 0.611619 1.664729
C  4.550184 -0.071227 0.992018
C  4.082887 1.051138 1.720348
H  -1.220268 0.407152 -2.349959
H  -1.493898 1.824199 -1.266615
H  -2.625264 -1.35991 -2.304829
H  -4.159067 -1.172221 -1.418726
H  -4.438785 0.454237 0.170234
H  -3.413039 1.903942 0.015959
H  4.056948 -1.605464 -0.50115
H  2.384584 2.400965 2.096713
H  -1.587243 -2.545297 -0.348645
H  -3.112094 -2.296618 0.613655
H  -2.833049 -0.447752 1.957639
H  -1.907717 1.112028 1.832237
H  5.572268 -0.432691 1.143224
H  4.751184 1.547707 2.430796
