program: Gaussian 09
title: 000243556
version: EM64L-G09RevD.01
frameworkgroup: C1[X(C12H8Br2O)]
method: RPBEPBE
basis: SDD
operation: Freq
keyword: #p
keyword: freq=noraman
keyword: PBEPBE/SDD
title: #p freq=noraman PBEPBE/SDD
converged: NO NO NO NO
title: Mulliken charges:
elementType: Br Br O C C C C C C C C C C C C H H H H H H H H
charge: 0.028040 0.053181 -0.388641 0.280553 0.266670 -0.339492 -0.353817 -0.377358 -0.377356 -0.364055 -0.346425 0.509319 -0.217669 -0.217669 -0.236253 0.268602 0.268346 0.246487 0.246486 0.229939 0.229938 0.231616 0.359560
chargesum: 0.00000
title: Mulliken charges with hydrogens summed into heavy atoms:
elementType: Br Br O C C C C C C C C C C C C
charge: 0.028040 0.053181 -0.029081 0.280553 0.266670 -0.070889 -0.085472 -0.130871 -0.130870 -0.364055 -0.346425 0.509319 0.012270 0.012269 -0.004637
polarizability: 2.27621835e+02 8.86377723e-01 1.69988982e+02 -5.23768149e-03 -5.86733480e-04 1.00187234e+02
1716.lowfreq: -44.8504 -2.7818 -2.4610 -0.0005 -0.0003 0.0005 7.2107 53.1239 60.9428
frequency: -44.7961 53.1213 60.9410 83.4848 118.6902 173.7358 196.3604 219.6712 224.3792 255.5690 291.0842 348.4297 396.4604 398.0810 418.0837 487.3988 490.4104 565.2614 584.5683 601.5528 632.3991 698.1139 710.9097 721.8821 722.2842 774.3242 838.8666 852.1227 875.4417 895.6316 921.6946 974.1294 987.2159 996.7974 1013.3194 1034.4573 1059.2384 1076.7830 1128.1014 1172.9938 1186.8781 1223.8213 1255.1688 1300.3218 1309.8176 1352.1895 1366.5742 1378.3883 1427.7096 1451.9678 1489.4255 1543.7589 1582.2031 1592.0001 1610.8206 3123.1358 3128.7203 3140.3646 3149.5743 3164.3432 3164.5749 3167.5691 3500.9653
redmass: 3.9053 7.6661 5.7527 10.6464 21.4453 4.5793 6.0028 16.0343 6.7100 7.6301 8.5401 5.5878 5.2214 2.8429 1.1077 4.5404 5.4369 3.5605 8.6645 5.2684 5.2017 3.8738 2.1605 6.3667 5.0925 2.0832 7.1863 1.2433 1.4818 1.3604 1.4024 1.3837 6.2402 1.3119 5.0097 3.0607 2.1569 1.6054 1.5425 1.0537 1.1164 1.6979 1.5444 3.8329 1.3725 3.7400 6.8288 5.0864 2.1880 3.0978 3.1122 6.5531 5.9916 7.8258 6.3172 1.0846 1.0879 1.0926 1.0969 1.1018 1.0924 1.0934 1.0649
irintensity: 0.0169 0.1955 0.1378 0.0376 0.0228 0.7239 0.9816 0.6717 1.3214 5.8271 0.5504 2.2667 3.3221 0.0063 133.3826 16.6080 0.8581 14.7590 21.7459 2.9770 1.4746 7.5213 142.9972 16.5652 11.9571 13.1080 0.6618 0.0058 21.1409 3.0151 0.2357 0.0001 3.0099 0.0390 0.3029 10.4907 17.6667 7.8761 197.7797 0.0210 2.0687 58.8370 51.1104 33.3730 0.5956 36.0478 0.0091 4.7630 8.2282 162.1421 3.2079 54.0535 1.4883 2.6532 4.2606 1.8886 0.1194 17.2117 35.2280 23.1187 0.0976 1.2730 69.7165
temp: 298.150 k
press: 1.00000 atm
elementType: 35 35 8 6 6 6 6 6 6 6 6 6 6 6 6 1 1 1 1 1 1 1 1
symmnumber: 1
zpe: 422666.3 jmol-1
zpe.correction: 0.160985 hartree
zpe.thermalcorrener: 0.173673 hartree
zpe.thermalcorrenthalpy: 0.174617 hartree
zpe.thermalcorrgfe: 0.119493 hartree
zpe.sumelectzpe: -563.173322 hartree
zpe.sumelectthermal: -563.160635 hartree
zpe.sumelectthermalent: -563.159691 hartree
zpe.sumelectthermalfe: -563.214815 hartree
dipole: -2.2569 -1.5725 0.0002
dipole: 2.7507
quadrupole: -93.3261 -107.3906 -102.3937
quadrupole: -5.8045 0.0002 0.0018
quadrupole: 7.7107 -6.3538 -1.3569 -5.8045 0.0002 0.0018
hfenergy: -563.3343075 hartree
pointgroup: C01 [X(C12H8Br2O1)]
dipole: -0.8946556 0.6089125 -0.0000968 debye
dipolederiv: -0.2941777 -0.2340221 0.0000081 -0.2795514 -0.5791918 0.0000352 0.0000188 0.0002204 -0.0086374 -0.1975844 0.2426361 -0.0000296 0.3357308 -0.5271985 0.0000573 -0.0000443 -0.0001445 -0.0004876 -1.3896358 -0.1381396 -0.0000321 -0.053709 -0.1229788 -0.0000258 -0.0000403 -0.0000534 -0.3716902 0.2966705 -0.0162902 0.000016 0.035781 0.0189271 -0.0000138 0.0000045 -0.0000493 -0.0782279 0.3748747 0.0019921 0.0000144 -0.0032018 -0.1272904 0.0000233 0.000024 0.0001307 0.0094569 -0.2196724 0.0107905 -0.0000073 0.1747464 -0.1495305 0.0000108 -0.0000302 0.0000344 -0.0638364 -0.234573 0.0755052 -0.0000125 -0.1909778 -0.1854435 0.000003 0.0000256 0.0000111 -0.0576771 -0.1991659 -0.0017082 -0.0776686 -0.0031037 -0.1238247 0.0011021 0.0162336 0.0016497 0.0511906 -0.1991727 -0.0015808 0.0776488 -0.0031274 -0.123833 -0.0010301 -0.0162523 -0.0017923 0.0511953 0.1724639 0.2939033 -0.0000113 0.6950843 0.925692 -0.0000657 -0.0000631 -0.0001175 -0.1459583 0.173913 -0.317915 0.0000402 -0.7390683 0.9567504 -0.0001219 0.0000981 0.0001458 -0.1403111 1.0714842 0.1066522 0.0000308 0.0784714 -0.5006632 0.000064 0.0000345 0.0000273 0.134297 -0.0305137 0.0003637 0.0807506 0.0024551 -0.1381214 0.0010281 0.0605305 0.0003619 0.0830442 -0.0304863 0.000368 -0.0807599 0.0024453 -0.138132 -0.000933 -0.0605394 -0.0001863 0.0830327 0.0932712 0.0017524 0.0000058 0.0019361 -0.1612545 0.0000201 0.0000054 -0.0000962 -0.0689857 0.096184 -0.0650503 0.000002 -0.0780292 0.0133618 0.0000085 0.0000035 0.0000196 0.1361331 0.0971942 0.0614055 -0.0000051 0.0790392 0.0158578 0.0000135 -0.0000131 -0.0001201 0.1401036 0.0637647 -0.0004974 0.0958506 -0.0007021 0.1322285 0.0002501 0.098312 0.0002952 -0.0343841 0.063771 -0.0005921 -0.0958434 -0.0007421 0.1322348 -0.000326 -0.0983098 -0.0002488 -0.0343998 -0.0026793 -0.0012955 -0.0857126 -0.0007831 0.1529662 -0.0006925 -0.108111 -0.0007655 -0.0680398 -0.0026928 -0.0012103 0.0857186 -0.0007353 0.1529866 0.0005962 0.1081149 0.0007087 -0.068024 -0.1461975 -0.0017957 -0.0000085 -0.0023893 0.1595347 -0.0000156 -0.0000088 -0.0000065 0.088251 0.4429601 -0.015272 0.0000048 -0.049569 0.2169226 0.000012 0.0000072 -0.0000244 0.3639549 unknown
polarizability: 227.634334|-0.2552042|169.9764824|0.0052438|-0.0005294|100.187234 unknown
InChI: InChI=1S/C12H8Br2O/c13-10-6-9(7-11(14)12(10)15)8-4-2-1-3-5-8/h1-7,15H
charge 0 multiplicity 1
23 atoms
Br 3.025363 2.921781 -0.000124
Br 3.019496 -2.888391 0.000381
O  4.163141 -0.041231 0.000188
C  -0.089437 0.013208 0.000003
C  -1.592216 0.00603 -0.000059
C  0.638608 -1.205604 0.00014
C  0.624912 1.236504 -0.000073
C  -2.312558 0.001016 -1.223317
C  -2.312658 0.001545 1.223143
C  2.031608 1.224042 -0.000012
C  2.045679 -1.202384 0.000199
C  2.77756 0.014989 0.000124
C  -3.72652 -0.007978 -1.223222
C  -3.726619 -0.00745 1.222937
C  -4.437226 -0.012121 -0.000171
H  0.099934 -2.157494 0.000199
H  0.082633 2.186203 -0.000182
H  -1.762842 0.003256 -2.171626
H  -1.763017 0.004192 2.171495
H  -4.270918 -0.012189 -2.174387
H  -4.271096 -0.011253 2.174059
H  -5.533095 -0.019396 -0.000213
H  4.547668 0.874926 0.000118
