program: Gaussian 09
title: 000243544
version: EM64L-G09RevD.01
frameworkgroup: C1[X(C11H10O4)]
method: RPBEPBE
basis: SDD
operation: Freq
keyword: #pfreq=noraman
keyword: PBEPBE/SDD
title: #p freq=noraman PBEPBE/SDD
converged: YES YES NO NO
title: Mulliken charges:
elementType: O O O O C C C C C C C C C C C H H H H H H H H H H
charge: -0.193073 -0.180790 -0.410254 -0.228345 -0.263869 -0.262625 -0.250098 -0.482682 0.115336 -0.183663 0.126684 -0.196678 0.160102 -0.260637 -0.245461 0.302332 0.302803 0.305529 0.232218 0.246967 0.243671 0.217964 0.260598 0.260259 0.383709
chargesum: 0.00000
title: Mulliken charges with hydrogens summed into heavy atoms:
elementType: O O O O C C C C C C C C C C C
charge: -0.193073 -0.180790 -0.026545 -0.228345 0.038463 0.040178 0.055430 -0.003496 0.115336 0.060008 0.126684 0.021287 0.160102 -0.000040 0.014798
polarizability: 1.42775134e+02 -1.35975944e+01 1.20466181e+02 -5.45927136e+00 4.87685162e+00 9.95473337e+01
1716.lowfreq: -13.0601 -0.0010 -0.0007 -0.0006 5.3102 16.3182 31.9935 52.4024 72.6121
frequency: 31.9084 52.3297 72.6078 94.3368 120.0379 172.0997 202.9062 263.6757 272.6685 295.5398 381.6330 409.6860 418.9573 450.5404 499.7236 505.5479 543.2993 578.3425 598.6490 604.5776 666.5552 698.5753 703.5353 743.1146 754.0076 804.8774 858.3004 873.7929 915.6001 930.3324 952.8221 974.3068 978.0218 1010.8527 1015.3844 1057.6137 1085.0008 1091.9571 1138.1983 1163.9869 1197.5025 1208.6442 1226.5538 1244.9142 1255.2963 1274.1029 1287.7514 1304.0850 1318.3702 1335.2777 1349.1892 1362.3399 1368.8760 1460.3303 1575.0338 1590.8790 1612.1037 1648.9172 1680.5274 2951.1375 2954.3779 2962.7563 3027.4201 3044.4340 3115.7071 3129.9461 3155.0566 3158.7612 3517.9162
redmass: 10.0770 6.5713 7.0012 4.2925 6.7452 3.6513 4.5737 4.4013 5.3068 6.7739 6.1276 5.2523 3.1018 6.5259 4.1112 4.9866 3.3337 3.0386 1.9403 3.5081 2.1247 1.9119 4.0324 4.1296 3.4432 2.8517 3.1575 2.5210 3.3909 2.9880 2.9228 2.2339 1.3699 1.3524 2.5397 2.4326 1.8758 1.8060 1.6901 1.2154 1.4936 1.2373 1.4259 1.6268 1.7305 1.8833 1.4574 1.5201 1.7921 1.4826 1.7340 2.1817 1.5116 1.0855 11.4070 9.5616 7.1704 8.7762 6.8897 1.0798 1.0798 1.0658 1.0898 1.0894 1.0868 1.0866 1.0998 1.0972 1.0641
irintensity: 0.2627 0.9188 9.7429 2.2359 3.1102 0.0577 0.1874 1.0845 0.8051 1.0583 23.7351 0.9349 5.7637 8.8311 25.7614 13.0413 31.0733 32.0488 29.9065 7.6338 100.8289 49.0050 2.6195 0.2862 8.2283 4.6302 14.7707 36.9833 27.2678 16.5648 3.6849 9.3834 1.5425 0.2382 0.7116 251.4138 27.8819 71.7377 3.4268 5.0265 6.8123 12.3502 16.8505 30.2925 3.0829 30.6448 29.9696 50.4834 29.6788 1.9709 8.0435 2.0477 0.4692 11.8490 16.8893 279.6405 4.6662 204.2584 1.5061 17.0301 19.0978 22.9566 4.5641 12.3680 9.8708 0.3171 12.3625 17.4517 33.4170
temp: 298.150 k
press: 1.00000 atm
elementType: 8 8 8 8 6 6 6 6 6 6 6 6 6 6 6 1 1 1 1 1 1 1 1 1 1
symmnumber: 1
zpe: 492287.9 jmol-1
zpe.correction: 0.187503 hartree
zpe.thermalcorrener: 0.200426 hartree
zpe.thermalcorrenthalpy: 0.201370 hartree
zpe.thermalcorrgfe: 0.146991 hartree
zpe.sumelectzpe: -724.952805 hartree
zpe.sumelectthermal: -724.939882 hartree
zpe.sumelectthermalent: -724.938937 hartree
zpe.sumelectthermalfe: -724.993317 hartree
dipole: -0.6666 0.3472 1.4296
dipole: 1.6151
quadrupole: -75.8467 -97.7552 -88.6482
quadrupole: 10.7206 3.4375 -8.8726
quadrupole: 11.5700 -10.3385 -1.2315 10.7206 3.4375 -8.8726
hfenergy: -725.1403076 hartree
pointgroup: C01 [X(C11H10O4)]
dipole: -0.2819054 0.1008168 0.5604944 debye
dipolederiv: -0.6028587 0.1287732 0.0685257 0.0361863 -0.7735251 -0.172161 0.0164265 -0.2065652 -0.3615545 -0.6019536 0.0781886 0.1349825 0.2366652 -0.7464356 -0.2142992 0.1400431 -0.1479556 -0.3932226 -1.3384973 0.1070614 0.1831394 0.0516725 -0.3872051 0.0395039 0.1538271 0.0549871 -0.3102873 -0.7487954 -0.0048497 -0.0840143 0.0162237 -0.2921893 -0.2098084 0.1173775 -0.0611363 -0.9323391 -0.0898391 -0.0828342 -0.0309803 -0.1586412 -0.159013 -0.0678916 -0.2367675 -0.1799267 -0.0462547 -0.3365292 -0.0004918 0.14427 -0.0177271 0.0793749 -0.0114619 0.2766843 0.0281035 -0.0356801 -0.0622306 0.0595465 -0.0419142 -0.0980181 0.0009547 0.0085838 -0.1979782 -0.0033125 -0.2492202 -0.0885489 0.0451936 0.0912939 0.0739086 0.1338391 0.0202383 -0.1038429 0.0401635 0.1248843 0.9608668 -0.2001017 -0.1277288 0.1043266 0.7442879 0.262172 0.0464313 0.3301598 0.2829519 -0.1255159 -0.0749878 -0.1528265 -0.1046699 -0.0236793 -0.2517144 -0.0549886 -0.1719187 0.1582297 0.8463268 0.1903744 -0.2624606 -0.0997016 0.9601613 0.3024466 -0.247743 0.20476 0.2793087 0.1975711 -0.0850991 -0.0818845 -0.0866122 -0.125515 -0.0363025 -0.0977853 -0.0790414 -0.0969318 1.7099242 -0.1074916 0.0582973 0.0090333 0.2143569 0.3274841 -0.0250868 0.1637384 1.1640952 -0.3452939 0.1841792 0.0669905 0.1688068 0.0563502 0.0256694 0.0678791 0.0327095 -0.1123814 0.0823075 -0.1659294 -0.0419095 -0.1511606 -0.3349024 -0.0436879 -0.0867281 -0.0199161 -0.0839677 0.1328612 -0.0031825 0.0321434 0.0118178 0.0452426 0.0313433 0.1110525 0.0720531 0.0071604 0.0374362 -0.0437687 -0.0398547 -0.0524144 -0.0123614 -0.0360451 -0.0388084 -0.0361725 0.0244402 0.126393 0.0211883 -0.0067153 0.1453873 0.0452484 0.0292748 0.0182673 0.0202631 0.0731959 -0.0811201 -0.0186159 -0.0910481 -0.0864172 0.0450947 -0.0795272 -0.0209923 -0.0595505 0.0272193 0.0553986 0.0512706 0.003474 0.0490688 -0.0920776 0.0495694 0.049349 0.0086112 0.064934 -0.0338908 0.0234908 0.1008115 0.0380822 0.102171 0.0365211 0.0903061 0.0441036 0.0592602 0.0295039 -0.0049575 0.0756509 0.029183 0.0757274 0.1197045 0.0956038 0.1015764 -0.0540712 0.0054005 -0.0426088 0.005286 -0.0908771 0.0084236 -0.0297363 -0.0042748 -0.0457676 0.1342675 -0.0650195 -0.032203 0.0248906 0.0163662 0.0786334 -0.0176622 0.0249056 -0.0181239 0.1389461 0.3361033 -0.0221448 -0.0284191 -0.0404891 0.3570377 -0.0822135 -0.0931571 -0.0718423 0.1370171 unknown
polarizability: 140.9699347|-15.0810424|121.5861423|-4.2780742|6.6975632|100.2325724 unknown
InChI: InChI=1S/C11H10O4/c12-8-4-5-9(13)10-6(8)2-1-3-7(10)11(14)15/h1,3-7,10,14H,2H2
charge 0 multiplicity 1
25 atoms
O  0.431699 2.637863 0.691856
O  2.658089 -2.061146 -1.02604
O  -3.730563 0.270799 -0.600928
O  -2.102569 -0.177349 -2.189676
C  0.030178 0.462934 -0.398018
C  0.656295 -0.942621 -0.159587
C  -1.431727 0.56057 0.088692
C  0.558962 -1.368224 1.338589
C  0.905877 1.585746 0.171403
C  -1.713721 -0.245542 1.353026
C  2.122804 -1.001172 -0.588026
C  -0.81472 -1.091859 1.913099
C  -2.402955 0.173416 -1.026635
C  2.376877 1.42032 0.004676
C  2.937102 0.232656 -0.383499
H  0.027681 0.622232 -1.499058
H  0.097366 -1.681495 -0.761975
H  -1.635399 1.628173 0.326117
H  1.325908 -0.84168 1.945305
H  0.796799 -2.44578 1.415115
H  -2.699325 -0.094277 1.806129
H  -1.074995 -1.609503 2.845881
H  2.985666 2.309892 0.208057
H  4.01714 0.128142 -0.545989
H  -4.337571 0.019303 -1.348817
