program: Gaussian 09
title: 000243533
version: EM64L-G09RevD.01
frameworkgroup: C1[X(C7H13N)]
method: RPBEPBE
basis: SDD
operation: Freq
keyword: #pfreq=noraman
keyword: PBEPBE/SDD
title: #p freq=noraman PBEPBE/SDD
converged: YES YES NO NO
title: Mulliken charges:
elementType: N C C C C C C C H H H H H H H H H H H H H
charge: -0.137761 0.242745 -0.505108 0.308107 -0.722265 -0.697663 -0.696390 -0.675427 0.224796 0.238471 0.209310 0.219462 0.236995 0.231181 0.216641 0.203635 0.219708 0.204946 0.232873 0.220207 0.225537
chargesum: 0.00000
title: Mulliken charges with hydrogens summed into heavy atoms:
elementType: N C C C C C C C
charge: -0.137761 0.242745 -0.041840 0.308107 -0.056498 -0.046206 -0.038864 -0.229683
polarizability: 9.83869100e+01 -7.60393703e+00 8.54537113e+01 -3.51493357e+00 4.46067292e-01 6.48053911e+01
1716.lowfreq: -9.9100 -0.0006 -0.0002 0.0001 2.4764 10.4598 56.4173 132.0514 184.4149
frequency: 56.1577 132.0472 184.3641 220.3462 252.9881 259.0930 283.5909 324.5577 356.3036 382.8420 393.3457 446.3445 491.6789 608.1230 696.6406 760.3817 808.3973 837.1238 906.7117 912.1036 926.0525 947.3346 978.8988 1018.1223 1019.8237 1034.0932 1072.2966 1103.9955 1157.3037 1216.9985 1238.9098 1253.3291 1371.1872 1375.6020 1399.7883 1422.6230 1449.9307 1457.7370 1466.5124 1468.4270 1474.3242 1482.4130 1495.6099 1787.5628 2977.9528 2982.6466 2987.1248 3048.5474 3073.9066 3078.5404 3080.0419 3086.3717 3090.6861 3096.1633 3107.2921 3154.4157 3214.8931
redmass: 2.9088 3.1345 1.1192 1.7143 1.0935 1.1629 2.4047 2.3720 2.5264 2.3259 2.5950 2.5305 2.7614 3.0658 1.2338 3.8467 2.9444 1.2985 1.7615 1.7897 1.7821 1.2077 1.2867 1.4550 1.4311 1.4530 1.5549 1.8974 2.8172 2.8519 3.1423 3.2317 1.2090 1.2222 1.2135 1.1216 1.0616 1.0938 1.0524 1.0610 1.0576 1.0594 1.0552 9.1350 1.0349 1.0349 1.0357 1.0539 1.0999 1.1000 1.0994 1.0989 1.1005 1.0996 1.0607 1.1146 1.1146
irintensity: 0.4148 1.2623 0.8320 3.5323 0.3310 0.4636 0.1257 2.3169 3.3832 1.0106 2.7454 10.0472 8.5528 5.1466 1.9009 2.0182 6.2879 103.7530 6.7272 19.4260 9.2741 0.1290 2.8792 0.7745 6.1248 0.2027 17.3856 1.3226 31.0695 137.7277 14.8303 25.9059 31.8547 28.2273 10.7404 4.1301 0.3223 0.9495 0.2960 3.0398 9.2307 11.0851 15.9809 139.7808 21.3542 32.0796 15.0755 24.9880 6.8602 3.5696 39.0019 70.1459 4.4532 57.2739 4.0486 22.3012 12.2051
temp: 298.150 k
press: 1.00000 atm
elementType: 7 6 6 6 6 6 6 6 1 1 1 1 1 1 1 1 1 1 1 1 1
symmnumber: 1
zpe: 477971.5 jmol-1
zpe.correction: 0.182050 hartree
zpe.thermalcorrener: 0.191807 hartree
zpe.thermalcorrenthalpy: 0.192751 hartree
zpe.thermalcorrgfe: 0.148279 hartree
zpe.sumelectzpe: -328.566724 hartree
zpe.sumelectthermal: -328.556967 hartree
zpe.sumelectthermalent: -328.556023 hartree
zpe.sumelectthermalfe: -328.600495 hartree
dipole: 1.1360 -0.3236 1.2259
dipole: 1.7024
quadrupole: -50.5176 -47.8152 -53.1745
quadrupole: 1.4254 -0.8457 -0.7700
quadrupole: -0.0152 2.6872 -2.6721 1.4254 -0.8457 -0.7700
hfenergy: -328.7487736 hartree
pointgroup: C01 [X(C7H13N1)]
dipole: 0.379988 -0.0214846 -0.5511152 debye
dipolederiv: -1.2983916 -0.1687354 -0.0215213 -0.2438805 -0.3554315 -0.0348162 -0.3191383 -0.230712 -0.2774523 0.8040264 -0.0077471 -0.0723494 -0.1255463 0.2389932 0.0723098 -0.0606034 0.1648657 0.3159087 -0.0221139 -0.1196348 0.026401 0.002103 0.1141501 0.13212 -0.0212108 0.1840178 0.1824456 0.8984318 0.3281042 0.0187936 0.4079081 0.3566207 -0.189849 0.2202902 -0.1035085 0.0639494 -0.1512858 -0.0400925 -0.0006991 0.0505329 -0.0075678 -0.0866734 0.0491284 -0.0903118 -0.1587658 -0.0533116 -0.0650812 -0.0084859 -0.0572753 -0.0403544 0.0040952 0.0232992 -0.0100017 0.0305221 -0.028787 0.0245348 -0.025597 0.0399013 -0.0573077 0.066937 0.0277543 0.0586166 -0.0291337 -0.2855635 -0.1275437 0.1793095 -0.308797 -0.316502 -0.1216928 0.16177 -0.1410496 -0.415583 0.0963379 0.0181074 0.0095106 0.0309926 0.0411872 -0.0077536 -0.0201692 0.0428752 -0.1426237 0.0797497 0.0636639 0.0195376 0.0976506 -0.115481 -0.0159695 0.0101565 -0.0499305 0.0442045 0.0874511 0.0392809 -0.0670225 0.035803 -0.0514789 0.1422684 -0.0505236 0.0830586 -0.0375945 -0.0909831 0.101624 0.0835232 0.117648 0.0562152 -0.0509795 0.0873901 -0.0218949 0.0662311 -0.0018678 -0.128087 -0.0440218 -0.1183206 -0.0187317 -0.016697 -0.0061696 0.0120979 0.0758924 0.103772 -0.0172329 -0.0187325 -0.0283231 0.0514723 -0.063261 -0.062601 -0.1015263 -0.1121427 0.0698785 0.0722321 -0.0617848 0.0195073 -0.0627474 0.1051978 -0.0431052 0.1282468 -0.0045954 -0.1437214 0.0405553 0.0709228 0.0899964 0.0452095 -0.0418826 0.0942278 -0.0246389 0.0666468 -0.0098055 -0.1462766 0.0070272 -0.1086735 -0.0533659 0.0201527 -0.0163321 0.0042069 0.0786445 -0.1352242 0.1060454 0.0423871 0.1041893 0.0512983 -0.0005886 0.0738091 -0.0251939 0.0627235 0.1138325 -0.002659 -0.0189778 -0.0296469 0.0550702 -0.0953975 -0.0303369 -0.0443112 -0.1216016 0.0582408 0.0545136 -0.0678419 0.0188874 -0.0326412 0.1277349 -0.0715592 0.0975265 0.1460372 -0.0906652 -0.0255716 -0.0503787 0.0053435 0.1013929 0.0547449 -0.0460764 0.0675673 0.1662869 unknown
polarizability: 96.8189841|8.4434431|84.3966474|-2.9364974|-7.7269397|67.430381 unknown
InChI: InChI=1S/C7H13N/c1-6-5-8(6)7(2,3)4/h1,5H2,2-4H3
charge 0 multiplicity 1
21 atoms
N  -0.237613 0.564244 0.419497
C  1.026875 -0.029922 -0.15351
C  -1.294095 1.347522 -0.378952
C  -1.538673 0.035618 0.295988
C  0.823587 -0.615353 -1.575839
C  2.074841 1.103737 -0.173679
C  1.449504 -1.148517 0.829207
C  -2.347133 -1.010246 0.558277
H  -1.244115 1.340103 -1.477918
H  -1.596655 2.300373 0.069722
H  0.582473 0.175011 -2.310488
H  1.750217 -1.112654 -1.91416
H  0.008674 -1.362351 -1.583019
H  2.22011 1.50898 0.842767
H  1.745976 1.930962 -0.829389
H  3.044236 0.729118 -0.548987
H  0.709597 -1.969345 0.834878
H  2.428079 -1.567838 0.533513
H  1.531361 -0.746209 1.853803
H  -1.984812 -1.903202 1.078198
H  -3.403935 -0.974829 0.279794
