program: Gaussian 09
title: 000020833
version: EM64L-G09RevD.01
frameworkgroup: C1[X(C11H16)]
method: RPBEPBE
basis: SDD
operation: Freq
keyword: #p
keyword: freq=noraman
keyword: PBEPBE/SDD
title: #p freq=noraman PBEPBE/SDD
converged: YES YES NO NO
title: Mulliken charges:
elementType: C C C C C C C C C C C H H H H H H H H H H H H H H H H
charge: -0.240038 0.581573 -0.642390 -0.578844 -0.695653 -0.694803 0.472898 0.456663 -0.582241 -0.817709 -0.822284 0.206257 0.236230 0.232479 0.211982 0.226401 0.209726 0.211466 0.209503 0.226721 0.234530 0.222356 0.223383 0.232811 0.222521 0.233099 0.223362
chargesum: 0.00000
title: Mulliken charges with hydrogens summed into heavy atoms:
elementType: C C C C C C C C C C C
charge: -0.033780 0.581573 -0.406160 -0.346365 -0.047544 -0.047113 0.472898 0.456663 -0.347711 -0.139159 -0.143301
polarizability: 1.45094807e+02 -1.02006392e+00 1.29689858e+02 3.15885613e-01 5.55423080e-02 7.85341359e+01
1716.lowfreq: -13.5500 -6.3886 -0.0004 0.0003 0.0008 5.4800 8.5295 38.6605 46.0361
frequency: -11.6368 38.4133 45.8844 111.1071 163.5254 195.0193 207.1774 220.3688 241.8227 248.7833 294.9422 315.3876 395.1604 471.2454 504.0924 523.2988 532.6744 589.9955 597.9028 717.7852 838.6677 867.5079 895.4103 907.6302 918.7846 926.1330 944.7825 953.4708 989.7319 999.3545 1016.0544 1044.8227 1050.0149 1081.0614 1114.3827 1149.8241 1178.6283 1189.4568 1279.2338 1307.0469 1307.9599 1336.5786 1375.4701 1378.1827 1394.3384 1395.0705 1396.2228 1432.5196 1450.2511 1465.0214 1467.7557 1472.6136 1473.4138 1476.4930 1479.7372 1482.8536 1490.1271 1611.5672 1614.4416 2971.7143 2972.1436 2972.2400 2975.1992 2978.8489 3052.6531 3052.8883 3064.6449 3071.9956 3075.8504 3080.3726 3080.5070 3080.7587 3104.4394 3105.8539 3111.5045
redmass: 1.0123 2.6928 1.0216 2.9333 2.5777 2.8388 1.0657 3.0395 1.0972 2.5674 2.6120 3.2492 2.4255 3.0488 4.5000 3.1643 4.2568 2.7554 3.5634 1.9961 3.2424 1.4639 1.3117 1.3974 1.2040 2.2994 3.0863 1.4543 5.6377 1.5456 1.4955 1.5380 1.5995 1.5492 2.5700 1.7373 1.4198 1.5753 1.4327 1.3245 2.1500 2.3213 1.1948 5.0016 1.2217 1.2275 1.2635 2.0565 2.0225 1.0469 1.0495 1.0518 1.0557 1.0496 1.2539 1.1574 1.2018 5.8938 5.9793 1.0382 1.0348 1.0381 1.0363 1.0830 1.0953 1.0953 1.1000 1.0992 1.1005 1.0996 1.0997 1.0997 1.0907 1.0908 1.0920
irintensity: 0.3240 0.0614 0.5613 1.9167 0.2054 3.7424 0.0292 0.0363 0.1134 0.2644 0.6432 1.2013 0.0040 0.4766 0.4976 0.1707 0.1250 0.3169 0.2588 18.8802 1.6824 26.1515 0.1614 1.0645 4.2247 6.3118 3.2093 0.0133 0.5574 11.9606 1.8922 4.8415 26.2650 10.5314 1.4349 0.8866 0.1112 7.3989 2.0915 0.8524 1.1627 5.4985 15.7935 1.7543 8.6078 20.6859 3.4597 1.4659 2.0838 4.4882 0.7065 2.4235 22.9306 15.7804 13.6823 5.6441 33.5532 29.9647 33.1116 55.6139 31.0072 29.0924 33.5879 17.2706 5.7130 42.0181 0.0526 102.9386 25.8951 30.3693 19.7327 21.7171 33.7962 33.4442 2.4287
temp: 298.150 k
press: 1.00000 atm
elementType: 6 6 6 6 6 6 6 6 6 6 6 1 1 1 1 1 1 1 1 1 1 1 1 1 1 1 1
symmnumber: 1
zpe: 617983.8 jmol-1
zpe.correction: 0.235378 hartree
zpe.thermalcorrener: 0.247179 hartree
zpe.thermalcorrenthalpy: 0.248123 hartree
zpe.thermalcorrgfe: 0.197279 hartree
zpe.sumelectzpe: -427.942719 hartree
zpe.sumelectthermal: -427.930918 hartree
zpe.sumelectthermalent: -427.929974 hartree
zpe.sumelectthermalfe: -427.980818 hartree
dipole: 0.0482 -0.0199 0.1215
dipole: 0.1322
quadrupole: -63.0980 -62.8709 -71.6563
quadrupole: 0.2261 0.2106 0.0178
quadrupole: 2.7770 3.0042 -5.7812 0.2261 0.2106 0.0178
hfenergy: -428.178097 hartree
pointgroup: C01 [X(C11H16)]
dipole: -0.0189228 0.0080166 0.047764 debye
polarizability: 145.0736731|-1.1727707|129.7115922|-0.2404375|-0.067724|78.5335355 unknown
InChI: InChI=1S/C11H16/c1-8(2)11-6-9(3)5-10(4)7-11/h5-8H,1-4H3
charge 0 multiplicity 1
27 atoms
C  2.25192 0.559172 0.001037
C  0.748867 0.263429 -0.000898
C  -0.190829 1.322538 -0.006451
C  0.26431 -1.069405 -0.006094
C  2.943331 0.010444 1.278219
C  2.947078 0.015207 -1.276116
C  -1.587328 1.07725 -0.014333
C  -1.123333 -1.350166 -0.014192
C  -2.036653 -0.265521 -0.024007
C  -2.578655 2.229515 0.004928
C  -1.626392 -2.784817 0.005061
H  2.373709 1.661465 0.003224
H  0.172382 2.359394 -0.009533
H  0.974911 -1.906587 -0.008654
H  2.861779 -1.091239 1.330391
H  2.481859 0.426308 2.192001
H  4.018588 0.270585 1.280985
H  2.866479 -1.086335 -1.332317
H  4.022167 0.276101 -1.275089
H  2.48761 0.433852 -2.189606
H  -3.115275 -0.471412 -0.041327
H  -3.530398 1.952841 -0.482575
H  -2.17567 3.119094 -0.511278
H  -2.817236 2.532852 1.043254
H  -2.619632 -2.871743 -0.470135
H  -1.724654 -3.158965 1.043038
H  -0.934034 -3.464256 -0.523432
