program: Gaussian 09
title: 000243507
version: EM64L-G09RevD.01
frameworkgroup: C1[X(C9H7NO3S)]
method: RPBEPBE
basis: SDD
operation: Freq
keyword: #p
keyword: freq=noraman
keyword: PBEPBE/SDD
title: #p freq=noraman PBEPBE/SDD
converged: NO YES NO NO
title: Mulliken charges:
elementType: S O O O N C C C C C C C C C H H H H H H H
charge: 0.291834 -0.186782 -0.418267 -0.189656 -0.063200 -0.341294 0.356440 -0.151349 -0.265116 -0.325153 -0.239840 -0.208273 -0.328768 0.165364 0.246726 0.254716 0.232253 0.232064 0.273623 0.273755 0.390924
chargesum: 0.00000
title: Mulliken charges with hydrogens summed into heavy atoms:
elementType: S O O O N C C C C C C C C C
charge: 0.291834 -0.186782 -0.027343 -0.189656 -0.063200 -0.341294 0.356440 -0.151349 -0.018390 -0.070437 -0.007587 0.023790 0.218609 0.165364
polarizability: 2.01355238e+02 8.47301716e+00 1.34336299e+02 -5.57616963e-02 2.29994110e-02 5.30863823e+01
1716.lowfreq: -6.6532 -1.9630 -0.0016 0.0005 0.0015 5.6554 17.6109 38.8091 73.6734
frequency: 17.6100 38.8072 73.6640 106.6173 148.5913 187.0706 191.7280 252.5599 319.4366 354.5052 433.4883 448.3003 486.3475 492.8689 498.6657 535.3325 577.3305 584.8509 625.4410 630.8226 672.7672 716.4874 728.4393 763.6239 853.6452 861.7328 892.1700 944.0708 966.6614 983.5456 987.7901 1015.2935 1036.1724 1050.4712 1118.0259 1164.9178 1169.8050 1193.0778 1238.5672 1255.5348 1281.9559 1368.9505 1376.1958 1434.6448 1442.4456 1445.9611 1525.6207 1572.3527 1607.0875 1704.0920 3015.4499 3075.7641 3137.3340 3150.9141 3165.1253 3175.8556 3527.7577
redmass: 11.6615 5.8398 7.3317 2.9897 5.0458 5.8548 9.1614 7.8529 6.2992 8.7490 3.1986 8.3476 8.1088 7.0182 1.8051 5.1400 6.1427 6.0090 1.4512 8.9520 7.2829 8.7240 2.8693 1.4772 5.7343 1.3743 5.5526 1.3824 7.3054 1.3165 1.9964 2.6390 3.6661 2.4070 1.5567 7.1803 1.1152 1.0755 2.4575 1.6274 1.8622 1.8463 4.7491 2.7975 1.1222 2.5400 8.7949 6.3853 7.3498 9.4056 1.0572 1.1041 1.0856 1.0904 1.0955 1.1000 1.0643
irintensity: 0.5748 0.8782 2.8167 6.9830 3.1157 2.4242 0.2565 0.9287 1.4787 3.4051 13.4974 21.8042 2.5730 22.8530 30.7730 0.1209 41.2111 0.1644 147.5345 17.2151 2.1761 12.3827 16.4291 83.6834 3.6229 1.2481 26.0152 2.6831 124.5057 0.0943 0.4869 50.9085 62.7896 235.6689 29.1337 321.3268 0.3262 0.9954 14.4127 21.3291 4.5992 26.2232 4.6784 46.3384 84.0192 8.2461 390.9895 5.3144 23.4449 200.1655 28.7971 4.6458 1.6613 8.5252 15.7633 16.1431 39.9032
temp: 298.150 k
press: 1.00000 atm
elementType: 16 8 8 8 7 6 6 6 6 6 6 6 6 6 1 1 1 1 1 1 1
symmnumber: 1
zpe: 380558.1 jmol-1
zpe.correction: 0.144947 hartree
zpe.thermalcorrener: 0.157184 hartree
zpe.thermalcorrenthalpy: 0.158128 hartree
zpe.thermalcorrgfe: 0.104031 hartree
zpe.sumelectzpe: -1024.634298 hartree
zpe.sumelectthermal: -1024.622060 hartree
zpe.sumelectthermalent: -1024.621116 hartree
zpe.sumelectthermalfe: -1024.675213 hartree
dipole: 0.6729 2.1770 0.0052
dipole: 2.2786
quadrupole: -66.2419 -88.3521 -89.6185
quadrupole: -10.1693 -0.0355 -0.0467
quadrupole: 15.1623 -6.9479 -8.2143 -10.1693 -0.0355 -0.0467
hfenergy: -1024.7792444 hartree
pointgroup: C01 [X(C9H7N1O3S1)]
dipole: 0.2844864 0.8501229 -0.002899 debye
dipolederiv: -0.4272945 0.0740504 -0.0001095 0.1266772 -0.3078633 0.0026723 -0.0002963 0.0027295 0.1093125 -2.157029 0.1821882 -0.0000756 0.278928 -0.4042449 0.0011343 -0.0008816 0.0011385 -0.2515475 -0.8727706 0.5425873 0.0006511 0.5525451 -0.8930346 -0.0000984 -0.0000962 0.0008343 -0.4370468 -0.7549523 -0.2351089 -0.0003642 0.0130484 -0.8759009 -0.0003118 -0.000732 -0.0012985 -0.292273 -0.999531 -0.1443548 0.0014741 -0.430762 -0.7584038 0.0041072 0.0034087 0.0039248 -0.1836824 0.2643479 0.2949275 -0.0023003 0.4996797 0.0616678 -0.0014921 -0.0036605 -0.0013499 -0.1073044 0.5917748 0.1185773 -0.001147 -0.1001582 -0.0152531 0.0005007 0.0002306 0.0003165 0.0474814 2.1195468 -0.270883 0.00049 0.1787296 0.988764 -0.0061467 -0.0028101 -0.0058564 0.0736998 -0.0546652 -0.096396 0.0005928 -0.1605003 0.0371502 -0.0008763 0.0010003 -0.0009101 -0.1157267 -0.0354378 -0.03966 0.0001503 -0.0667179 0.0685914 -0.0013736 0.0003372 -0.0013997 -0.1499711 -0.006161 -0.0404944 0.0000979 -0.0286318 0.0172435 -0.0012224 0.0000374 -0.0012027 -0.1722691 -0.0194878 0.0935952 -0.0007415 0.1246991 0.0366544 -0.0013926 -0.0009351 -0.0013721 -0.1622739 0.4629073 -0.2138734 0.0008244 -0.8867311 0.2542334 0.0000231 0.006301 0.000038 0.3471006 1.6052218 -0.1751285 0.000429 -0.2589561 1.4961907 0.000814 0.0007438 0.0006264 0.212308 0.0763013 0.0165392 -0.0000327 0.0656138 -0.0488638 0.0013611 -0.0003435 0.0014011 0.1667538 0.072904 0.0632612 -0.0003299 0.0275562 -0.0440957 0.0013705 -0.0001021 0.0013414 0.1685042 -0.1222447 0.0364322 0.0000075 0.0327631 0.0774709 0.0005602 0.0000336 0.0005537 0.1676314 -0.0197763 -0.1050876 0.0008401 -0.1147319 -0.0236234 0.0013149 0.0009066 0.0013066 0.1633018 0.0417448 -0.0008418 -0.0228279 0.1484835 0.0343714 -0.0494147 0.0028726 -0.0593746 0.005316 0.0424341 -0.0011182 0.0229747 0.1482032 0.0357011 0.0488432 -0.0053577 0.0588989 0.0045159 0.1921677 -0.0992118 -0.0006034 -0.1497373 0.2632447 -0.0003728 -0.0006568 -0.0003457 0.4061698 unknown
polarizability: 201.7116325|6.9115882|133.9774796|-0.1223123|-0.4411701|53.0888073 unknown
InChI: InChI=1S/C9H7NO3S/c11-8(12)5-13-9-10-6-3-1-2-4-7(6)14-9/h1-4,11H,5H2
charge 0 multiplicity 1
21 atoms
S  0.586588 -1.973809 0.015577
O  -1.813381 -0.672224 0.008834
O  -4.858164 1.314704 -0.000062
O  -4.562827 -0.999022 -0.001813
N  0.150046 0.702318 -0.001643
C  2.007296 -0.828889 0.006866
C  1.553335 0.531731 -0.001675
C  -0.46044 -0.460465 0.006445
C  3.375838 -1.151964 0.007799
C  2.500163 1.581169 -0.009323
C  4.309068 -0.088819 0.000036
C  3.873741 1.262332 -0.008412
C  -2.620395 0.55928 0.001339
C  -4.082018 0.145495 0.000574
H  3.717929 -2.191235 0.014316
H  2.150632 2.617812 -0.015811
H  5.380324 -0.315976 0.000595
H  4.614964 2.068398 -0.01431
H  -2.392295 1.174675 0.890496
H  -2.389078 1.165787 -0.893166
H  -5.823824 1.0742 -0.002663
