program: Gaussian 09
title: 000243515
version: EM64L-G09RevD.01
frameworkgroup: C1[X(C10H9ClN6O)]
method: RPBEPBE
basis: SDD
operation: Freq
keyword: #p
keyword: freq=noraman
keyword: PBEPBE/SDD
title: #p freq=noraman PBEPBE/SDD
converged: YES YES NO NO
title: Mulliken charges:
elementType: Cl O N N N N N N C C C C C C C C C C H H H H H H H H H
charge: -0.072857 -0.328406 -0.446627 -0.147683 -0.099637 -0.609091 -0.032133 -0.566967 0.465322 0.227198 -0.139254 -0.275814 -0.468479 0.211754 -0.081892 -0.175308 0.016737 -0.275297 0.357158 0.331463 0.240313 0.234474 0.258759 0.327151 0.367840 0.340954 0.340323
chargesum: 0.00000
title: Mulliken charges with hydrogens summed into heavy atoms:
elementType: Cl O N N N N N N C C C C C C C C C C
charge: -0.072857 -0.328406 -0.089470 -0.147683 -0.099637 0.085900 -0.032133 0.114310 0.465322 0.227198 -0.139254 0.055649 -0.228167 0.211754 -0.081892 0.059165 0.016737 -0.016538
polarizability: 2.93493563e+02 -6.01753968e+00 2.22995831e+02 -1.88113829e-01 -1.35678664e-02 6.26207452e+01
1716.lowfreq: -5.8921 -0.0011 -0.0011 0.0026 2.7990 4.5010 28.4991 53.6650 68.5679
frequency: 28.4919 53.6560 68.5679 87.9695 155.3282 177.4676 186.8822 206.6170 235.3178 239.4481 283.0857 316.7221 323.7187 337.4295 350.8066 386.3809 411.2335 441.8235 481.2421 536.1417 546.0621 566.0174 568.5756 584.7685 618.7327 641.7764 672.4376 679.8249 685.8437 722.1949 740.0067 772.3924 774.9820 783.3687 843.8505 856.9081 874.9812 890.7637 920.6802 959.5027 968.0300 980.6569 1007.7014 1070.3959 1086.5107 1140.0160 1157.4112 1180.0949 1226.0374 1251.7162 1269.2368 1284.9964 1330.9000 1372.2293 1391.9064 1433.4217 1445.0095 1474.9792 1478.0288 1492.4423 1548.5949 1570.8487 1588.9988 1598.5961 1611.5609 1625.6949 3130.7644 3155.4489 3180.8631 3198.7430 3224.8523 3355.6316 3548.5483 3600.9343 3707.1617
redmass: 8.0626 5.4285 8.9501 6.8322 12.0336 6.1420 4.9265 7.9162 6.7816 7.6496 6.1364 5.6265 3.5221 4.1662 5.1064 11.5968 8.0123 3.1558 4.0596 1.2152 8.1384 3.6474 1.1614 7.5571 1.4004 6.5010 4.1846 6.7132 2.1321 10.3705 6.7423 1.8273 8.1686 2.9178 1.1978 1.2554 6.2190 1.3786 1.4079 2.5250 1.3364 6.0631 3.4307 1.9884 1.6680 3.0066 2.3717 1.0855 5.7213 2.7044 1.8368 2.8933 3.4230 5.6847 6.9256 2.9226 3.7768 2.9196 2.0378 2.3672 4.0534 2.9505 2.6916 2.9087 6.5194 2.1941 1.0887 1.0929 1.0975 1.0933 1.0635 1.0759 1.0446 1.0895 1.1059
irintensity: 1.6600 1.6966 1.1701 0.0084 5.1995 0.4374 4.3057 2.3815 3.9431 8.2984 1.2479 8.1618 24.5812 0.2495 0.3602 9.8332 6.9530 5.4730 0.0277 247.4265 1.4267 0.2146 2.0653 24.8037 166.1336 15.9435 30.7159 24.6655 34.5376 6.6101 1.7830 20.6391 8.3351 9.7127 22.4373 200.5078 19.7154 15.6662 38.8835 6.1958 2.4410 9.3676 39.9992 17.1169 9.8981 36.6945 72.8080 0.3572 49.8824 43.8207 82.9052 89.4568 32.4779 326.0557 96.8477 36.2523 97.4736 35.1116 26.7679 154.6964 1152.2063 287.3992 599.5537 427.7230 44.1467 143.3459 7.3215 11.4770 4.5747 20.9438 67.3871 65.0344 157.2002 87.2320 53.0400
temp: 298.150 k
press: 1.00000 atm
elementType: 17 8 7 7 7 7 7 7 6 6 6 6 6 6 6 6 6 6 1 1 1 1 1 1 1 1 1
symmnumber: 1
zpe: 506624.3 jmol-1
zpe.correction: 0.192963 hartree
zpe.thermalcorrener: 0.208253 hartree
zpe.thermalcorrenthalpy: 0.209197 hartree
zpe.thermalcorrgfe: 0.149594 hartree
zpe.sumelectzpe: -1248.980305 hartree
zpe.sumelectthermal: -1248.965015 hartree
zpe.sumelectthermalent: -1248.964071 hartree
zpe.sumelectthermalfe: -1249.023674 hartree
dipole: 0.6236 2.5754 0.0242
dipole: 2.6499
quadrupole: -105.4464 -99.5621 -115.3322
quadrupole: 21.7675 -0.0314 -0.0134
quadrupole: 1.3338 7.2181 -8.5520 21.7675 -0.0314 -0.0134
hfenergy: -1249.1732681 hartree
pointgroup: C01 [X(C10H9Cl1N6O1)]
dipole: 0.4337559 0.9350378 0.1565329 debye
polarizability: 287.4006485|-20.695613|225.7867026|14.1031112|18.4454386|65.9227878 unknown
InChI: InChI=1S/C10H9ClN6O/c11-5-2-1-3-6(4-5)14-9-7(17-18)8(12)15-10(13)16-9/h1-4,14H,12-13H2
charge 0 multiplicity 1
27 atoms
Cl -4.15474 2.758472 -0.106086
O  3.08491 -2.925607 -0.257598
N  -0.350601 -0.887984 -0.253474
N  0.729057 1.219277 0.088115
N  3.19599 1.298344 0.278751
N  4.453535 -0.682867 0.1214
N  1.96197 -2.225139 -0.252218
N  1.88165 3.212185 0.423484
C  -1.718383 -0.534336 -0.312134
C  0.778239 -0.12602 -0.076387
C  2.045613 -0.855391 -0.074745
C  -2.182144 0.803626 -0.189336
C  -2.652302 -1.591581 -0.505088
C  3.248588 -0.055889 0.112599
C  -3.564743 1.03514 -0.264684
C  -4.030465 -1.313175 -0.57461
C  1.943985 1.856317 0.257781
C  -4.512576 0.012142 -0.455036
H  -0.111997 -1.888616 -0.359179
H  -1.463488 1.609354 -0.041288
H  -2.295603 -2.624036 -0.599437
H  -4.741679 -2.132169 -0.723109
H  -5.580968 0.236249 -0.508113
H  5.300709 -0.12982 0.252385
H  4.428248 -1.713204 -0.008969
H  2.745009 3.734633 0.552284
H  0.975688 3.674796 0.416192
