program: Gaussian 09
title: 000243536
version: EM64L-G09RevD.01
frameworkgroup: C1[X(C16H19N2O2P)]
method: RPBEPBE
basis: SDD
operation: Freq
keyword: #p
keyword: freq=noraman
keyword: PBEPBE/SDD
title: #p freq=noraman PBEPBE/SDD
converged: YES YES NO NO
title: Mulliken charges:
elementType: P O O N N C C C C C C C C C C C C C C C C H H H H H H H H H H H H H H H H H H H
charge: 1.218602 -0.555965 -0.593233 -0.449608 -0.444825 -0.042355 -0.012650 -0.417788 -0.452442 -0.692883 -0.708292 0.235472 0.158874 -0.363246 0.423721 -0.221306 -0.363585 -0.462679 -0.423906 -0.243420 -0.239586 0.271376 0.274991 0.242477 0.263459 0.248815 0.270968 0.214210 0.229440 0.236326 0.215720 0.225279 0.248292 0.286383 0.261363 0.229159 0.238545 0.238110 0.228988 0.227197
chargesum: 0.00000
title: Mulliken charges with hydrogens summed into heavy atoms:
elementType: P O O N N C C C C C C C C C C C C C C C C
charge: 1.218602 -0.555965 -0.593233 -0.449608 -0.444825 0.229020 0.262342 0.088149 0.067341 -0.012907 -0.019001 0.235472 0.158874 -0.076863 0.423721 0.007853 -0.102221 -0.224134 -0.185795 -0.014432 -0.012389
polarizability: 2.70490443e+02 -9.67793710e+00 1.65643909e+02 6.92057134e+00 -1.91819475e+01 2.20765857e+02
1716.lowfreq: -7.5127 -0.0018 -0.0008 0.0008 4.3116 6.8316 16.2498 22.2737 31.2634
frequency: 16.1421 22.1831 30.9229 45.2955 62.1263 63.5240 96.2930 122.5416 146.3501 155.6724 178.1782 185.2376 188.7800 204.6332 219.4896 242.5402 259.5920 285.0422 306.0938 346.4129 384.0550 393.7314 414.2997 420.7668 428.2254 459.7999 469.6825 486.5568 508.2221 539.4860 556.0090 583.2937 624.7714 636.8134 645.4572 718.1078 730.1250 747.4727 761.1100 781.8423 785.2757 814.7725 832.2652 850.0806 869.1676 881.4291 894.7483 900.6729 909.4908 966.0246 968.3230 980.9183 991.2065 995.3899 1013.1644 1022.6867 1029.6587 1031.3022 1041.7200 1067.8988 1068.8446 1076.8511 1119.2447 1125.9999 1139.7703 1143.9353 1144.9329 1166.8707 1169.1103 1170.7875 1177.9874 1225.8968 1237.8851 1243.2424 1251.9607 1262.2633 1370.5943 1376.5053 1377.4867 1398.6065 1399.0777 1401.2405 1419.1154 1439.4641 1449.9012 1457.3475 1457.7689 1464.2969 1465.2027 1474.5944 1475.7017 1512.5473 1578.4555 1593.6782 1634.4365 2986.2440 2988.9344 3078.7307 3079.8649 3082.6952 3083.3556 3085.7037 3088.1657 3103.3708 3107.4707 3121.7746 3128.7600 3135.4165 3151.4868 3154.0780 3170.5440 3173.5408 3191.9711 3196.6675
redmass: 4.6518 4.1249 3.4604 3.4695 3.9583 3.6332 4.0273 3.7799 4.3827 3.6956 4.1198 1.3512 1.8597 1.7600 3.4448 4.2702 3.9738 4.7646 5.1388 4.6378 2.8119 3.4923 3.0435 3.2150 3.5450 5.2412 3.3462 6.4813 6.7636 6.1792 5.6152 4.1329 6.9306 6.8187 4.1321 6.5335 4.7201 1.3616 3.6490 2.5380 2.9933 1.6227 3.7082 3.8120 4.9879 1.6039 1.2107 1.2842 1.4469 1.4157 2.1551 1.3719 2.2082 1.3355 3.6357 1.8985 1.6158 1.9141 2.9600 1.3946 1.4140 2.1577 1.3014 1.2924 1.4943 1.4544 1.4474 1.8134 1.1066 1.7327 1.2556 1.9288 2.1066 1.7111 1.7226 1.6984 2.2185 1.5271 1.5141 1.4532 1.4959 3.0375 4.8976 2.6663 2.4772 1.0726 1.0759 1.1522 1.1479 1.0472 1.0468 3.8632 7.4460 5.6021 6.9539 1.0359 1.0359 1.0750 1.0811 1.0973 1.0885 1.0793 1.0676 1.0974 1.0974 1.0859 1.0868 1.0899 1.0948 1.0956 1.0980 1.0965 1.1177 1.1183
irintensity: 0.1565 0.1506 2.2007 0.6513 3.5421 2.1464 2.3320 0.3180 3.4958 6.3145 3.6531 1.1685 2.6280 6.4564 1.6017 1.3520 4.2655 2.9557 11.1009 18.2829 4.3682 11.2469 6.6950 3.4756 1.6311 31.8058 1.4616 9.0447 5.1295 19.0783 30.3276 10.1428 93.7849 95.9017 30.8160 127.9405 8.4136 0.4800 3.3212 41.0069 26.7072 63.3195 152.1737 131.5716 65.9993 5.2092 9.0415 6.2712 1.1578 10.0412 45.6223 7.3679 36.9812 1.0470 66.3158 17.8006 74.1711 52.7998 104.1688 6.1799 11.5888 37.6766 6.4200 7.5225 19.7012 2.7224 6.7998 12.7524 0.2592 4.7387 26.2305 82.0556 27.8481 29.0469 36.6522 16.5336 34.3999 18.6096 9.1418 25.2507 52.0900 25.7478 5.5892 7.5641 27.8423 14.4794 13.0298 11.4094 4.9642 11.2819 6.0840 22.7744 48.8566 10.5725 2.5424 21.3059 27.0403 19.2815 2.1388 14.3705 20.3377 1.8859 26.1523 19.0286 24.6823 0.8680 1.9901 14.7714 28.2142 34.0428 18.8494 1.4285 4.0954 8.7092
temp: 298.150 k
press: 1.00000 atm
elementType: 15 8 8 7 7 6 6 6 6 6 6 6 6 6 6 6 6 6 6 6 6 1 1 1 1 1 1 1 1 1 1 1 1 1 1 1 1 1 1 1
symmnumber: 1
zpe: 830767.3 jmol-1
zpe.correction: 0.316423 hartree
zpe.thermalcorrener: 0.337447 hartree
zpe.thermalcorrenthalpy: 0.338391 hartree
zpe.thermalcorrgfe: 0.264369 hartree
zpe.sumelectzpe: -1220.658081 hartree
zpe.sumelectthermal: -1220.637057 hartree
zpe.sumelectthermalent: -1220.636113 hartree
zpe.sumelectthermalfe: -1220.710135 hartree
dipole: -0.7461 0.6965 -2.1306
dipole: 2.3625
quadrupole: -119.6767 -123.4446 -128.6145
quadrupole: -5.0490 -8.8500 -0.1764
quadrupole: 4.2353 0.4673 -4.7026 -5.0490 -8.8500 -0.1764
hfenergy: -1220.974504 hartree
pointgroup: C01 [X(C16H19N2O2P1)]
dipole: 0.315269 -0.2822957 -0.8275427 debye
polarizability: 269.9506055|-14.6121542|166.4420911|-4.2489284|18.6622173|220.5075121 unknown
InChI: InChI=1S/C16H19N2O2P/c1-12-10-17(12)21(19,18-11-13(18)2)20-16-9-5-7-14-6-3-4-8-15(14)16/h3-9,12-13H,10-11H2,1-2H3
charge 0 multiplicity 1
40 atoms
P  -2.211319 -0.309618 0.535258
O  -0.799631 0.626937 -0.015507
O  -2.503467 -0.207902 2.102487
N  -3.47826 0.278931 -0.508683
N  -1.847642 -1.910081 -0.153354
C  -3.703868 1.754076 -0.770762
C  -0.93153 -2.82998 0.662179
C  -3.229866 0.835361 -1.890597
C  -2.41587 -3.122504 0.579324
C  -5.133718 2.242927 -0.666079
C  0.101342 -3.594782 -0.13902
C  0.42935 0.662369 0.690493
C  1.617339 0.390113 -0.07487
C  0.489165 0.996394 2.046647
C  2.898905 0.492186 0.595074
C  1.761528 1.078432 2.692712
C  1.572754 0.024117 -1.45931
C  2.942177 0.838796 1.98633
C  4.090835 0.232042 -0.160741
C  2.75302 -0.227416 -2.163566
C  4.022591 -0.118852 -1.510856
H  -2.934448 2.429581 -0.370892
H  -0.59256 -2.428545 1.628102
H  -3.945803 0.484102 -2.64097
H  -2.190696 0.93028 -2.223869
H  -2.779151 -3.90246 -0.097085
H  -3.023042 -2.937952 1.474374
H  -5.259342 3.185245 -1.230849
H  -5.832324 1.491303 -1.071312
H  -5.404801 2.429989 0.387993
H  0.45056 -4.477316 0.428611
H  -0.325969 -3.938315 -1.096743
H  0.974198 -2.955492 -0.360907
H  -0.435269 1.181841 2.601313
H  0.596111 -0.058594 -1.945062
H  1.797753 1.339915 3.75576
H  3.914859 0.912233 2.486184
H  5.061527 0.312943 0.343153
H  2.711461 -0.509494 -3.221426
H  4.9406 -0.314914 -2.075937
