program: Gaussian 09
title: 000243540
version: EM64L-G09RevD.01
frameworkgroup: C1[X(C20H25N2O2P)]
method: RPBEPBE
basis: SDD
operation: Freq
keyword: #p
keyword: freq=noraman
keyword: PBEPBE/SDD
title: #p freq=noraman PBEPBE/SDD
converged: YES YES NO NO
title: Mulliken charges:
elementType: P O O N N C C C C C C C C C C C C C C C C C C C C H H H H H H H H H H H H H H H H H H H H H H H H H
charge: 1.231304 -0.551449 -0.607557 -0.464581 -0.445083 -0.035709 -0.010861 -0.442797 -0.468916 -0.388018 -0.394534 -0.679512 -0.674664 0.366784 -0.370226 -0.407528 -0.381054 -0.376827 0.354261 0.340672 -0.393966 -0.395830 -0.236201 -0.235049 -0.243729 0.270881 0.271336 0.265926 0.242007 0.270358 0.247909 0.210463 0.201090 0.210084 0.201957 0.213166 0.246712 0.209325 0.213300 0.236876 0.214588 0.306665 0.249292 0.239281 0.239781 0.236595 0.235621 0.224615 0.224370 0.228869
chargesum: 0.00000
title: Mulliken charges with hydrogens summed into heavy atoms:
elementType: P O O N N C C C C C C C C C C C C C C C C C C C C
charge: 1.231304 -0.551449 -0.607557 -0.464581 -0.445083 0.235173 0.260476 0.065136 0.049352 0.023536 0.017506 -0.010309 -0.009899 0.366784 -0.063561 -0.158236 -0.141773 -0.137046 0.354261 0.340672 -0.157371 -0.160208 -0.011586 -0.010679 -0.014860
polarizability: 3.90883553e+02 -1.05859936e+00 2.05213000e+02 6.52742606e+00 -1.20040955e+01 2.21490368e+02
1716.lowfreq: -17.1142 -2.9399 -0.9716 -0.0008 -0.0001 0.0014 5.1048 10.5970 21.9305
frequency: -15.8200 9.9134 21.7309 30.8511 44.8261 51.7850 63.1637 69.6663 72.4631 86.5988 94.3055 101.5041 130.3560 144.8763 170.7733 181.1427 206.5796 229.1566 234.1528 245.6398 258.9907 265.2421 311.1313 334.2940 337.9471 351.4705 384.5289 397.2113 403.0899 405.9647 415.2738 425.5172 461.6194 479.6880 497.0353 536.6858 555.2629 562.7498 613.1952 621.9050 630.0502 645.7931 702.2077 720.8430 725.4911 727.3541 746.9369 770.2265 796.7779 805.0353 829.1621 831.0173 832.6470 843.8642 849.7960 851.5282 906.5332 917.6626 939.3111 954.5280 955.5345 956.5429 972.4906 973.7237 988.0653 992.5814 992.9950 1013.6720 1016.6903 1022.0722 1027.7779 1040.0158 1050.6199 1052.6864 1084.8725 1089.3751 1090.5434 1115.9287 1119.0519 1125.0211 1132.9723 1135.8438 1169.0362 1170.0984 1171.2563 1172.9301 1191.9985 1211.0622 1234.7396 1247.2081 1262.3379 1263.1584 1289.2830 1303.0852 1308.9877 1310.1611 1311.8898 1353.4153 1374.0040 1386.1704 1388.8352 1397.5369 1401.8168 1417.3835 1438.9763 1451.8528 1455.5843 1459.6769 1461.1471 1472.4798 1477.1075 1478.0882 1485.4245 1487.2791 1508.8079 1568.4372 1588.0705 1611.6014 1615.1731 2981.9215 2982.7458 2984.7513 2985.7481 3039.4519 3041.8484 3074.7544 3076.7659 3079.3235 3082.9036 3084.5678 3086.9161 3090.4929 3091.5807 3121.3517 3125.7400 3135.9530 3136.6710 3140.6331 3147.8966 3161.0687 3164.1590 3166.2481 3190.6962 3194.8195
redmass: 3.0937 4.5930 3.7278 3.9011 4.3264 4.5066 3.8231 2.8908 3.3271 4.0442 2.6884 4.0885 3.5683 5.3492 3.6226 3.6766 2.4616 1.3333 1.9303 3.9807 3.8280 4.1645 3.7324 4.3186 2.9361 5.0216 3.2187 4.5167 2.8504 2.8548 3.0088 4.2831 3.5659 4.6792 3.3251 5.5304 3.0006 5.2287 6.7376 7.6026 5.8593 7.4368 1.7402 3.5163 3.4006 5.3932 2.3176 1.9021 1.3188 1.3131 2.7889 2.9563 1.5675 2.9822 1.3099 1.4984 5.0247 1.4474 3.2653 1.3476 1.3489 1.2356 1.4291 1.3681 4.9861 1.3213 6.1001 3.0940 3.1787 1.3834 1.5973 1.8945 1.9119 2.2692 1.6217 1.5942 1.5982 1.3505 1.3217 1.3216 1.4347 1.4287 1.8507 1.9593 1.8667 1.0553 1.2029 1.5468 1.7382 1.7824 1.2074 1.2225 2.9371 1.3533 1.3437 1.3478 1.4631 3.0189 7.7258 1.5105 1.4939 1.4866 1.4736 3.9681 2.4131 1.0817 1.0864 1.1640 1.1608 2.0923 1.0591 1.0433 1.0561 1.0609 2.7827 6.3518 6.5935 6.0497 6.2705 1.0523 1.0412 1.0448 1.0558 1.0983 1.0985 1.0871 1.0961 1.0667 1.0904 1.0789 1.0689 1.1001 1.0998 1.0844 1.0872 1.0885 1.0894 1.0908 1.0961 1.0960 1.1012 1.0969 1.1178 1.1182
irintensity: 0.5107 0.0770 0.1474 0.7114 0.5881 1.3237 1.2157 3.2404 0.1945 1.1816 0.9289 2.0660 4.3302 3.3391 6.1648 0.3987 3.1960 0.3650 7.2854 2.2367 0.8777 7.7519 9.9881 9.8650 7.5866 1.2637 1.6538 6.0413 7.3400 0.2030 0.2362 13.5539 8.3925 41.8485 12.7720 21.8645 0.6134 19.3612 26.5312 162.2350 75.1709 42.5002 46.1299 42.4101 13.1813 37.8870 6.4370 77.9269 14.1700 4.6351 119.7679 169.5122 76.0758 51.7200 12.7835 49.7598 109.0800 1.5891 148.3014 7.1311 6.1782 14.3038 0.0827 6.0652 0.4772 0.1972 11.1686 18.5727 30.0889 3.2174 38.2570 8.9552 5.5116 30.9639 8.3523 4.7196 4.6912 21.3664 6.9543 6.4217 7.8041 1.0480 191.8779 17.6288 44.5519 1.2837 31.6390 131.9808 41.6497 49.1706 0.1311 0.7206 12.1071 4.3305 20.5936 1.9260 1.9674 5.5663 0.6460 13.7320 18.2709 5.5702 16.5260 2.6145 4.8686 7.4794 7.5016 11.9033 6.5022 192.1798 11.3853 11.4156 23.7634 18.6332 79.4246 5.0411 4.6238 64.1994 19.8519 45.0650 35.6029 18.9997 27.0102 5.2596 5.6527 7.2737 18.7088 34.9467 31.7985 46.2178 16.6116 44.7626 42.5126 9.2678 0.9761 11.5402 17.5298 4.4202 44.2392 4.7616 30.3322 5.4561 4.1826 8.1075
temp: 298.150 k
press: 1.00000 atm
elementType: 15 8 8 7 7 6 6 6 6 6 6 6 6 6 6 6 6 6 6 6 6 6 6 6 6 1 1 1 1 1 1 1 1 1 1 1 1 1 1 1 1 1 1 1 1 1 1 1 1 1
symmnumber: 1
zpe: 1064970.9 jmol-1
zpe.correction: 0.405626 hartree
zpe.thermalcorrener: 0.430619 hartree
zpe.thermalcorrenthalpy: 0.431564 hartree
zpe.thermalcorrgfe: 0.347703 hartree
zpe.sumelectzpe: -1376.372014 hartree
zpe.sumelectthermal: -1376.347021 hartree
zpe.sumelectthermalent: -1376.346077 hartree
zpe.sumelectthermalfe: -1376.429937 hartree
dipole: 0.3809 1.0068 2.0096
dipole: 2.2797
quadrupole: -140.7802 -147.4131 -152.9466
quadrupole: -1.4244 6.7387 -7.5738
quadrupole: 6.2664 -0.3665 -5.9000 -1.4244 6.7387 -7.5738
hfenergy: -1376.7776401 hartree
pointgroup: C01 [X(C20H25N2O2P1)]
dipole: -0.0617494 0.0136233 0.8946802 debye
polarizability: 387.5360283|9.2497083|219.1111856|-24.2856245|12.1618392|210.9397072 unknown
InChI: InChI=1S/C20H25N2O2P/c1-3-18-14-21(18)25(23,22-15-19(22)4-2)24-20-12-10-17(11-13-20)16-8-6-5-7-9-16/h5-13,18-19H,3-4,14-15H2,1-2H3
charge 0 multiplicity 1
50 atoms
P  -2.90479 -0.773928 -0.094506
O  -1.648075 0.332618 0.491381
O  -2.764691 -1.203676 -1.628444
N  -4.371617 0.077934 0.304515
N  -2.859619 -2.057835 1.138768
C  -4.577309 1.546326 -0.006574
C  -1.922884 -3.245065 0.889408
C  -4.488937 1.07061 1.437181
C  -3.415871 -3.414967 0.709508
C  -5.887091 1.897246 -0.69016
C  -1.17803 -3.749469 2.113101
C  -5.836183 1.608824 -2.207191
C  0.061678 -2.888987 2.440253
C  -0.283794 0.312911 0.110699
C  0.171197 -0.14103 -1.150301
C  0.626914 0.829465 1.059934
C  1.549478 -0.075279 -1.441413
C  1.997597 0.892798 0.745653
C  2.491875 0.440072 -0.509703
C  3.944996 0.508404 -0.835784
C  4.554323 -0.463139 -1.678591
C  4.766322 1.547065 -0.314144
C  5.929327 -0.398653 -1.988925
C  6.142426 1.610755 -0.620032
C  6.732822 0.63832 -1.46041
H  -3.690223 2.08085 -0.377945
H  -1.339644 -3.203742 -0.042932
H  -3.580154 1.308878 2.000585
H  -5.404292 0.955858 2.027258
H  -3.798757 -3.506154 -0.314674
H  -4.006928 -3.90398 1.490152
H  -6.70187 1.313898 -0.221688
H  -6.103081 2.96932 -0.507964
H  -1.871555 -3.755897 2.974998
H  -0.877339 -4.800623 1.927219
H  -6.801693 1.845161 -2.689224
H  -5.608002 0.543561 -2.388082
H  -5.052335 2.210379 -2.704032
H  0.590408 -3.277566 3.329051
H  -0.23701 -1.845699 2.644315
H  0.777735 -2.875378 1.597614
H  -0.545131 -0.520864 -1.885473
H  0.250311 1.164744 2.031139
H  1.89044 -0.396997 -2.431804
H  2.697591 1.266585 1.501034
H  3.953515 -1.291989 -2.070201
H  4.318011 2.328753 0.309848
H  6.376133 -1.163071 -2.634794
H  6.751661 2.425333 -0.212064
H  7.800751 0.688315 -1.699958
