program: Gaussian 09
title: 000243454
version: EM64L-G09RevD.01
frameworkgroup: C1[X(C8H6N2O4)]
method: RPBEPBE
basis: SDD
operation: Freq
keyword: #pfreq=noraman
keyword: PBEPBE/SDD
title: #p freq=noraman PBEPBE/SDD
converged: YES YES NO NO
title: Mulliken charges:
elementType: O O O O N N C C C C C C C C H H H H H H
charge: -0.231296 -0.221863 -0.203925 -0.394643 0.048294 -0.023764 0.399499 -0.355564 0.270705 -0.303694 -0.322682 -0.151650 -0.249989 0.034440 0.269549 0.294309 0.244237 0.281447 0.240462 0.376128
chargesum: 0.00000
title: Mulliken charges with hydrogens summed into heavy atoms:
elementType: O O O O N N C C C C C C C C
charge: -0.231296 -0.221863 -0.203925 -0.018515 0.048294 -0.023764 0.399499 -0.086015 0.270705 -0.009385 -0.078445 0.129797 -0.009527 0.034440
polarizability: 3.65204679e+02 -2.61444018e+01 1.43576887e+02 -4.19258080e+00 2.47566990e+00 4.98103769e+01
1716.lowfreq: -3.3768 -1.5340 -0.0011 -0.0010 -0.0006 2.9140 38.5189 41.9113 69.8302
frequency: 38.5183 41.9052 69.8299 94.4828 119.4229 149.7396 173.5810 213.9981 232.9310 287.7041 307.9013 366.7618 391.6179 420.3305 437.3033 508.1064 544.9022 561.0043 600.1620 659.6751 675.8914 708.1944 724.2233 767.6231 798.6645 829.1467 878.9120 904.0806 908.0944 923.9900 976.0004 1023.9281 1052.4096 1126.2358 1166.1292 1199.4327 1226.4104 1237.2964 1286.6579 1296.8447 1299.2546 1337.4854 1357.8144 1403.9965 1496.1025 1544.2180 1618.8070 1973.0755 3093.4620 3130.0748 3147.0221 3228.8690 3258.6943 3527.8582
redmass: 8.8206 7.7177 8.1115 6.7530 6.7825 3.9672 7.8032 5.7245 5.6054 6.3860 3.1122 4.5149 1.8710 8.8984 2.0426 7.4523 5.9573 5.3865 5.8445 4.2182 8.5207 10.4719 11.5091 6.5294 1.2703 1.3741 1.8991 1.3964 9.5679 6.1246 1.1104 1.3156 3.0544 3.6554 1.9035 2.2424 2.5372 1.6397 2.1361 1.2925 2.1890 7.0426 3.8053 2.8709 7.6732 5.6276 5.6817 11.8676 1.0877 1.0934 1.0891 1.0960 1.1030 1.0678
irintensity: 0.8385 1.1999 1.1674 1.2282 0.6625 2.7675 0.5457 3.7169 7.9643 3.3647 2.5134 14.9852 111.4480 1.6999 43.7614 0.8665 10.8751 0.9292 30.6656 0.8774 9.6508 485.4200 115.1088 33.5201 58.5026 0.9658 32.4584 1.9951 14.6190 1.0865 78.4192 25.4069 40.4596 126.5032 29.7325 18.8505 302.6927 184.4759 36.8274 140.8674 38.9086 50.5854 66.7287 39.2622 228.0043 5.4367 146.1018 127.4931 4.3313 5.1270 7.4997 0.7260 4.7486 116.9746
temp: 298.150 k
press: 1.00000 atm
elementType: 8 8 8 8 7 7 6 6 6 6 6 6 6 6 1 1 1 1 1 1
symmnumber: 1
zpe: 343009.9 jmol-1
zpe.correction: 0.130646 hartree
zpe.thermalcorrener: 0.143730 hartree
zpe.thermalcorrenthalpy: 0.144674 hartree
zpe.thermalcorrgfe: 0.089214 hartree
zpe.sumelectzpe: -717.627934 hartree
zpe.sumelectthermal: -717.614850 hartree
zpe.sumelectthermalent: -717.613906 hartree
zpe.sumelectthermalfe: -717.669366 hartree
dipole: 4.0340 5.5952 -0.1241
dipole: 6.8989
quadrupole: -80.2533 -73.7317 -83.6159
quadrupole: -18.5485 -2.8868 0.8519
quadrupole: -1.0530 5.4686 -4.4156 -18.5485 -2.8868 0.8519
hfenergy: -717.75858 hartree
pointgroup: C01 [X(C8H6N2O4)]
dipole: 1.7136217 -2.1048803 0.0070141 debye
dipolederiv: -0.1085114 -0.0986356 -0.0133809 -0.0563866 -0.4730674 -0.0271505 -0.003282 -0.0299584 -0.0926421 -1.4171654 0.1643837 -0.0044534 0.1195557 -0.4285159 -0.0140038 -0.0172863 -0.0098689 -0.2482037 -0.2698248 -0.164329 -0.015163 0.4601262 -0.8471368 -0.0459867 0.0328273 -0.0503798 -0.2290527 -0.8886026 -0.2206978 0.1700631 -0.5865159 -0.5995122 0.1766003 1.6828881 0.8321418 -0.3011484 1.8886052 -0.2911927 0.0039495 -1.4067605 1.5310466 0.0903423 -0.0656531 0.0916607 0.2097987 -0.1479685 0.1429742 -0.194635 0.0353549 0.0640289 -0.2123705 -2.2472257 -0.9942907 0.1637531 1.0874178 -0.0328499 0.0126736 0.275248 0.0925181 0.0055876 0.0437336 -0.0054422 0.109223 -0.7758577 0.210324 0.0067535 -0.2108118 0.0303937 0.0134049 -0.0255269 0.0234002 -0.2080523 -0.6445304 0.1439642 0.0121875 1.3383798 -0.5289495 -0.0287658 0.0801407 -0.0412845 0.0780053 0.3210711 -0.0990748 0.0011081 -0.4686849 0.3171378 0.0208578 -0.0242612 0.0292726 -0.1131235 -0.6146503 0.0163607 -0.0072674 -0.4744109 0.1419858 0.0066796 -0.0599822 0.0184736 -0.1908501 0.7445763 0.0674693 0.0477073 0.230299 -0.0583573 0.0176372 0.0108523 0.0214854 -0.0765228 -0.4686099 -0.1266056 -0.0784014 -0.4709225 0.0488407 -0.025312 0.0420402 0.0401432 -0.1482703 0.5544898 0.258379 0.1500419 0.8983807 0.2573056 0.1559497 0.5836918 0.2011008 -0.0558516 0.1178087 0.0459569 0.0011955 0.0326512 0.0082749 -0.0133129 0.0009213 -0.0129557 0.197989 0.0640193 -0.0154525 -0.0042385 0.0175451 0.1427165 -0.004196 -0.0019686 -0.0043601 0.19997 0.0329828 0.0381757 -0.0021544 0.0676498 -0.0370616 -0.0149197 0.0020857 -0.011748 0.1759487 0.0317637 0.022517 0.0004953 0.076914 0.0085869 -0.0105199 0.0104559 -0.0092786 0.1733523 0.0423252 -0.031084 0.0008618 0.0596845 -0.0297767 -0.0079653 0.0141177 -0.0322815 0.1898986 0.4506612 -0.0305828 -0.087343 0.0627042 0.3595418 -0.0825565 -0.0585686 -0.05583 0.1657789 unknown
polarizability: 361.4457789|38.9376024|147.3397884|0.2859554|3.0943407|49.8063756 unknown
InChI: InChI=1S/C8H6N2O4/c11-9-6-2-1-3-7-4-5-8(14-7)10(12)13/h1-5,11H
charge 0 multiplicity 1
20 atoms
O  -1.225886 0.048532 0.061817
O  -4.679177 1.01787 0.053518
O  -2.760839 2.287993 0.191091
O  5.524697 1.761452 -0.681472
N  -3.385223 1.158327 0.093287
N  4.866075 1.070506 0.46228
C  -0.740493 -1.278925 -0.023356
C  -1.834978 -2.160719 -0.112725
C  -2.621922 -0.049594 0.021935
C  -3.029417 -1.378005 -0.084015
C  0.67842 -1.492147 -0.005786
C  1.618227 -0.483732 0.086549
C  3.042859 -0.739867 0.102379
C  3.988646 0.220782 0.182115
H  -1.767446 -3.244005 -0.189905
H  -4.060167 -1.718531 -0.132564
H  0.996837 -2.539736 -0.071915
H  1.279336 0.557164 0.150724
H  3.385717 -1.783383 0.039158
H  6.142636 2.378014 -0.202517
