program: Gaussian 09
title: 000243467
version: EM64L-G09RevD.01
frameworkgroup: C1[X(C18H18N4O4)]
method: RPBEPBE
basis: SDD
operation: Freq
keyword: #p
keyword: freq=noraman
keyword: PBEPBE/SDD
title: #p freq=noraman PBEPBE/SDD
converged: YES YES NO NO
title: Mulliken charges:
elementType: O O O O N N N N C C C C C C C C C C C C C C C C C C H H H H H H H H H H H H H H H H H H
charge: -0.287949 -0.287948 -0.238457 -0.238457 0.036453 0.036454 -0.361000 -0.361000 0.281237 0.281236 0.223782 0.223782 -0.342324 -0.342323 -0.349598 -0.349598 -0.246467 -0.246467 -0.225554 -0.225555 -0.357665 -0.357665 -0.533815 -0.533815 0.123033 0.123033 0.285196 0.285196 0.241369 0.241369 0.232551 0.232551 0.228067 0.228067 0.255046 0.255046 0.247502 0.225319 0.225301 0.247502 0.225301 0.225319 0.337971 0.337971
chargesum: 0.00000
title: Mulliken charges with hydrogens summed into heavy atoms:
elementType: O O O O N N N N C C C C C C C C C C C C C C C C C C
charge: -0.287949 -0.287948 -0.238457 -0.238457 0.036453 0.036454 -0.023029 -0.023030 0.281237 0.281236 0.223782 0.223782 -0.057128 -0.057128 -0.108229 -0.108229 -0.013915 -0.013916 0.002513 0.002513 -0.102619 -0.102619 0.164307 0.164307 0.123033 0.123033
polarizability: 6.10230221e+02 1.92487933e+00 2.66182338e+02 -3.45747942e-02 2.73784218e-02 1.01403507e+02
1716.lowfreq: -6.2589 -0.0017 -0.0013 0.0005 2.0550 3.3248 12.1931 16.6332 21.9182
frequency: 12.1931 16.6332 21.9182 44.0920 54.9880 55.3330 78.3782 97.8877 100.2887 116.2483 125.3676 139.1094 144.8970 175.8419 194.0667 194.6369 201.3823 230.0428 235.2481 259.8088 268.3595 273.7628 281.3917 329.3070 339.5151 347.9813 366.4249 397.2579 434.5336 472.6929 484.0308 491.4494 495.2650 509.8996 529.0554 543.4312 545.4154 565.8520 572.6115 621.3313 642.0828 742.7936 742.9425 758.8109 760.7896 762.0710 762.5796 763.0104 780.8703 783.5494 791.4565 841.7513 862.7163 862.7382 872.8545 953.5956 953.6052 968.5412 968.9202 970.1725 987.7569 987.9733 995.1658 995.2159 1023.0847 1042.9470 1043.5037 1072.0553 1104.3834 1113.0668 1113.0684 1115.4131 1150.7094 1151.4248 1174.2861 1175.3293 1179.1915 1190.4103 1208.9970 1210.6704 1237.5865 1237.7155 1296.6954 1297.0300 1323.0157 1332.3775 1388.3363 1391.1564 1430.5667 1430.6180 1448.7426 1448.9546 1467.3188 1467.3289 1468.1381 1468.1458 1482.5452 1482.8572 1504.4682 1510.2709 1559.1840 1562.4841 1590.7279 1592.1615 1607.3445 1608.0637 1627.1913 1638.5517 2965.1376 2965.2295 3034.8481 3034.8997 3055.9844 3055.9973 3128.0883 3128.0923 3134.5318 3134.5398 3151.6624 3151.6671 3166.3468 3166.3493 3175.2799 3175.3436 3320.3300 3320.3652
redmass: 4.5330 6.6888 5.8286 7.4703 5.5913 5.8178 5.1512 3.3363 3.4245 6.1386 6.3029 4.7391 5.5314 7.1566 2.5721 2.6038 5.8167 1.7974 1.4802 2.2217 3.5796 2.6922 4.3716 4.2650 6.7558 4.6526 7.7744 6.7530 6.3336 3.7387 3.2369 7.6353 6.5097 6.0523 7.6651 3.5631 3.6936 5.1371 5.4713 5.9435 5.7998 3.3006 3.3316 5.7123 2.6172 5.7499 1.2960 1.5806 1.1528 1.4206 8.2677 5.2945 1.4133 1.4135 5.0185 1.3520 1.3522 1.5000 1.4966 6.3230 8.8372 8.8298 1.3510 1.3514 7.1299 2.0620 2.1087 5.4260 2.2463 1.2575 1.2575 2.2680 1.3917 1.3872 1.1964 1.0913 1.9436 2.5556 1.9486 2.0946 2.3748 2.4493 1.5264 1.5416 1.7350 1.9388 6.9183 6.1498 1.4084 1.4050 1.8168 1.8287 1.3191 1.3199 1.0502 1.0502 1.6417 1.6333 2.1618 2.2429 5.8989 5.8422 6.1728 5.9772 6.4247 6.3432 6.8529 10.7747 1.0326 1.0326 1.0886 1.0886 1.1043 1.1043 1.0998 1.0998 1.0862 1.0862 1.0901 1.0901 1.0941 1.0941 1.0993 1.0993 1.0755 1.0746
irintensity: 1.6509 1.1550 1.4424 0.0000 0.0000 0.0000 0.6499 0.0000 11.8709 11.1406 0.0000 0.0000 12.7872 0.0000 0.0000 8.6425 25.5823 33.1397 0.0000 11.1450 0.0000 0.0000 15.6599 1.7222 91.2953 0.0000 0.0000 11.4504 0.0000 5.5211 0.0000 0.0000 8.3953 13.2875 0.0000 0.0000 0.2800 24.8631 0.0000 6.5809 0.0000 3.1500 0.0000 21.4769 0.0000 0.0001 212.5127 0.0016 149.5736 0.0000 98.2770 0.0000 0.6395 0.0004 27.7964 0.1211 0.0010 0.0000 69.1230 0.0000 98.5752 0.0002 0.0017 6.1553 96.9707 0.0000 28.5437 0.0000 69.4867 0.0249 0.2488 0.0000 0.4923 0.0000 116.1638 0.0000 66.5624 0.0000 0.0000 80.6804 388.9487 0.0054 52.8022 0.0001 145.9603 0.0000 198.1597 0.0000 56.9288 0.0005 73.5638 0.0002 0.0082 171.0954 0.0773 28.2514 51.4243 0.0000 0.0000 882.8195 51.9406 0.0000 162.6980 0.0000 0.0000 91.6304 706.5614 0.0000 173.0057 0.0140 58.7789 0.0617 0.2484 87.0329 0.0001 36.2869 1.4048 0.6473 13.5464 7.4608 5.3721 22.7710 58.4867 0.0511 50.4397 0.3114
temp: 298.150 k
press: 1.00000 atm
elementType: 8 8 8 8 7 7 7 7 6 6 6 6 6 6 6 6 6 6 6 6 6 6 6 6 6 6 1 1 1 1 1 1 1 1 1 1 1 1 1 1 1 1 1 1
symmnumber: 1
zpe: 879929.4 jmol-1
zpe.correction: 0.335147 hartree
zpe.thermalcorrener: 0.359799 hartree
zpe.thermalcorrenthalpy: 0.360743 hartree
zpe.thermalcorrgfe: 0.277122 hartree
zpe.sumelectzpe: -1214.677389 hartree
zpe.sumelectthermal: -1214.652737 hartree
zpe.sumelectthermalent: -1214.651793 hartree
zpe.sumelectthermalfe: -1214.735414 hartree
dipole: 0.0000 0.0000 0.0012
dipole: 0.0012
quadrupole: -49.2663 -140.3634 -157.1234
quadrupole: 29.3343 0.0239 -0.0188
quadrupole: 66.3181 -24.7791 -41.5390 29.3343 0.0239 -0.0188
hfenergy: -1215.0125363 hartree
pointgroup: C01 [X(C18H18N4O4)]
dipole: 0.0000017 -0.0000876 -0.0004607 debye
polarizability: 609.4784749|-15.0625552|261.2127289|6.2008248|-30.1790202|107.124862 unknown
InChI: InChI=1S/C18H18N4O4/c1-25-15-9-5-3-7-13(15)11-19-21-17(23)18(24)22-20-12-14-8-4-6-10-16(14)26-2/h3-12,21-22H,1-2H3
charge 0 multiplicity 1
44 atoms
O  6.301992 -2.2472 0.371185
O  -6.218936 1.840965 -0.483337
O  0.500045 1.510899 -0.371194
O  -0.416992 -1.916928 0.260141
N  3.056874 0.189815 -0.111478
N  -2.97382 -0.595916 0.00004
N  1.82274 -0.4287 -0.004313
N  -1.739686 0.022604 -0.107098
C  5.461302 -0.039601 -0.052448
C  -5.378247 -0.366546 -0.059243
C  6.59453 -0.897972 0.118578
C  -6.511472 0.491777 -0.230522
C  5.688206 1.339856 -0.311467
C  -5.605152 -1.745965 0.19998
C  7.909006 -0.381011 0.031108
C  -7.825948 -0.025193 -0.143098
C  6.993962 1.85734 -0.399431
C  -6.910908 -2.263457 0.287902
C  8.102513 0.9940 -0.227586
C  -8.019457 -1.400164 0.115806
C  4.109912 -0.593295 0.041466
C  -4.026856 0.187155 -0.153115
C  7.42266 -3.173816 0.552464
C  -7.339608 2.767539 -0.664809
C  0.643604 0.273959 -0.14084
C  -0.56055 -0.68002 0.029615
H  4.811635 1.982766 -0.439813
H  -4.728583 -2.388839 0.328518
H  8.777119 -1.033258 0.161593
H  -8.694059 0.627017 -0.273781
H  7.151151 2.921918 -0.599643
H  -7.068098 -3.328004 0.488274
H  9.122442 1.388718 -0.294316
H  -9.039385 -1.794888 0.1825
H  4.027843 -1.676133 0.242836
H  -3.944786 1.269965 -0.354637
H  6.957045 -4.15365 0.732507
H  8.053997 -3.221142 -0.355472
H  8.041493 -2.888134 1.424596
H  -6.873997 3.74736 -0.844933
H  -7.958368 2.481742 -1.536956
H  -7.971015 2.81496 0.243073
H  1.712803 -1.443306 0.183178
H  -1.629749 1.037184 -0.294727
