program: Gaussian 09
title: 000243472
version: EM64L-G09RevD.01
frameworkgroup: C1[X(C16H17N5OS)]
method: RPBEPBE
basis: SDD
operation: Freq
keyword: #p
keyword: freq=noraman
keyword: PBEPBE/SDD
title: #p freq=noraman PBEPBE/SDD
converged: YES YES NO NO
title: Mulliken charges:
elementType: S O N N N N N C C C C C C C C C C C C C C C C H H H H H H H H H H H H H H H H H
charge: 0.277602 -0.267308 -0.223742 -0.047410 -0.086373 -0.054687 -0.591405 -0.044648 -0.465560 -0.467703 -0.301661 0.178793 -0.219043 0.094862 -0.353690 -0.054128 -0.803390 0.476051 -0.378634 -0.378068 -0.221492 -0.221369 -0.236782 0.273708 0.226705 0.287530 0.241422 0.241476 0.226210 0.221693 0.288705 0.285830 0.284613 0.326020 0.328755 0.237615 0.237322 0.226795 0.226444 0.228939
chargesum: 0.00000
title: Mulliken charges with hydrogens summed into heavy atoms:
elementType: S O N N N N N C C C C C C C C C C C C C C C C
charge: 0.277602 -0.267308 -0.223742 -0.047410 -0.086373 -0.054687 0.063370 0.229060 0.048676 0.015195 0.146242 0.178793 0.069663 0.094862 -0.353690 -0.054128 -0.232947 0.476051 -0.141019 -0.140746 0.005303 0.005075 -0.007842
polarizability: 3.62666878e+02 -8.71018464e+00 2.08764542e+02 2.66673565e+00 1.36109438e+00 1.54869091e+02
1716.lowfreq: -7.5917 -2.8772 0.0008 0.0012 0.0016 5.1678 9.7216 18.6618 25.7058
frequency: 8.4897 18.6009 25.6484 36.7757 42.8795 67.8797 91.2482 105.6427 123.1540 141.7510 157.9475 178.4663 195.2101 254.1022 259.3301 292.5991 319.5643 323.1248 346.5562 400.9232 401.5559 416.5115 431.9635 474.1828 505.5472 507.7110 555.3825 584.5845 590.9771 604.1457 616.9980 621.9835 636.4809 660.5757 673.7363 701.3474 713.7265 758.1801 776.2054 782.6911 791.3033 810.3576 828.0136 836.5869 851.0305 867.4721 879.5945 886.6699 893.0351 915.6262 924.9796 934.4284 960.6875 976.1505 989.7057 995.7103 1026.2409 1026.7793 1029.9639 1049.4382 1072.6290 1074.9645 1112.1151 1121.2200 1143.2194 1159.2745 1172.6976 1177.7861 1187.4072 1194.7363 1216.6049 1218.4566 1242.1251 1266.9240 1279.1569 1302.8577 1305.3235 1317.5638 1324.2614 1325.6645 1335.2594 1343.9705 1374.3212 1384.4141 1429.1940 1439.7885 1444.7077 1468.8338 1474.7865 1484.2200 1489.3107 1492.9726 1514.9767 1561.5138 1593.3572 1604.4347 1614.2354 3010.3654 3024.1398 3027.5169 3049.9548 3055.8399 3072.3635 3097.2682 3112.7374 3121.0957 3122.6251 3125.5697 3136.3234 3147.4477 3164.3018 3259.9582 3567.8269 3726.9278
redmass: 4.8519 3.9438 4.0818 5.4098 4.7390 4.6239 3.5860 6.2965 4.7322 5.9436 4.5993 4.5971 4.2168 5.3215 5.0268 6.6031 3.8748 2.2864 6.0071 3.9073 2.7981 7.9902 1.2064 3.9331 3.0334 1.3013 5.7848 2.8391 8.0434 4.5282 6.3296 4.2855 5.2756 4.8855 5.4231 1.6426 11.9091 4.7686 2.1790 7.8932 7.7267 4.0653 2.3329 1.5579 1.2506 2.5639 4.8029 1.5322 1.8447 2.7300 1.4647 2.5659 4.5068 1.3918 5.6730 1.3470 2.6632 2.4891 2.7408 1.8972 1.4768 2.6410 2.1057 1.0890 1.3845 1.5279 1.0521 1.7832 1.1133 3.3255 1.6940 1.4792 1.6443 1.5207 3.3363 4.9877 1.4260 1.3558 1.2807 2.1024 1.8422 1.7323 4.7656 8.7610 4.2172 2.2053 1.1140 1.0883 1.0973 2.3680 3.1771 1.1084 9.4686 10.1692 6.1030 1.5040 6.1115 1.0578 1.0654 1.0628 1.0579 1.0882 1.1068 1.1043 1.1032 1.0850 1.0942 1.1018 1.0921 1.0965 1.1017 1.0981 1.0440 1.1059
irintensity: 0.3403 0.6201 0.6233 0.5269 1.5534 1.5407 0.6482 0.4062 0.8890 6.6030 4.1056 1.1333 0.5252 1.8085 0.2674 9.8057 11.7860 1.7640 5.8308 0.5081 0.0367 0.9800 290.1052 7.5399 1.7753 1.3670 18.1018 11.9272 0.5492 4.7830 0.1040 20.5243 7.7416 18.2506 10.3858 60.6844 7.1033 39.2138 28.1059 14.0371 4.0785 8.9947 9.2833 21.1165 0.0251 7.3839 125.7232 0.4072 14.1280 13.5792 4.6677 27.8015 2.2452 0.0220 0.4667 0.1409 56.9672 17.4769 94.5859 8.8689 8.7836 39.2213 22.7932 1.7196 14.8390 30.6758 0.0332 69.0561 1.7772 65.7510 18.2222 81.7257 15.4694 14.5976 4.8028 59.3341 15.8343 3.6786 0.2597 87.5994 50.3974 51.7991 64.7201 0.0833 50.5212 8.3263 10.8678 17.4059 20.3616 19.7665 162.8533 13.3745 372.6346 219.1225 0.9984 422.3901 5.1273 74.5002 21.0480 23.2541 7.2883 27.2636 12.8912 44.2393 17.9557 6.9350 0.0819 4.0326 16.0860 41.6513 27.5062 3.6354 113.6014 42.7823
temp: 298.150 k
press: 1.00000 atm
elementType: 16 8 7 7 7 7 7 6 6 6 6 6 6 6 6 6 6 6 6 6 6 6 6 1 1 1 1 1 1 1 1 1 1 1 1 1 1 1 1 1
symmnumber: 1
zpe: 819236.8 jmol-1
zpe.correction: 0.312031 hartree
zpe.thermalcorrener: 0.332430 hartree
zpe.thermalcorrenthalpy: 0.333374 hartree
zpe.thermalcorrgfe: 0.258424 hartree
zpe.sumelectzpe: -1365.301163 hartree
zpe.sumelectthermal: -1365.280763 hartree
zpe.sumelectthermalent: -1365.279819 hartree
zpe.sumelectthermalfe: -1365.354770 hartree
dipole: -2.4370 4.0276 1.9998
dipole: 5.1146
quadrupole: -108.8308 -135.4451 -136.7617
quadrupole: -2.9082 -9.1781 -3.8633
quadrupole: 18.1817 -8.4325 -9.7492 -2.9082 -9.1781 -3.8633
hfenergy: -1365.6131938 hartree
pointgroup: C01 [X(C16H17N5O1S1)]
dipole: -0.9526523 1.4365767 1.0382007 debye
polarizability: 362.5874051|-9.6929155|206.9239641|1.2212238|10.0777013|156.7891416 unknown
InChI: InChI=1S/C16H17N5OS/c17-16-19-14-13(18-10-21(14)12-7-4-8-22-12)15(20-16)23-9-11-5-2-1-3-6-11/h1-3,5-6,10,12H,4,7-9,17H2
charge 0 multiplicity 1
40 atoms
S  1.806045 -0.75128 -0.324316
O  -5.463422 -1.24785 -0.889754
N  -3.222055 -0.444604 -0.606072
N  -1.338218 -1.749151 -0.820783
N  -2.15618 1.708144 0.01745
N  0.2994 1.512131 0.13457
N  -0.790234 3.538925 0.562162
C  -4.660694 -0.048904 -0.698854
C  -5.163508 0.594948 0.608743
C  -5.503099 -0.646489 1.473225
C  -6.047042 -1.653508 0.434473
C  -2.139034 0.389073 -0.316631
C  -2.677224 -1.710965 -0.914116
C  -0.978294 -0.43959 -0.449038
C  0.265726 0.196197 -0.197626
C  -0.89421 2.206312 0.225173
C  3.071609 0.629539 0.101713
C  4.460622 0.040403 0.100034
C  5.241311 0.031234 -1.085209
C  5.010809 -0.514964 1.284653
C  6.543867 -0.515331 -1.086117
C  6.31299 -1.061836 1.286811
C  7.084028 -1.063235 0.10078
H  -4.790439 0.587057 -1.5907
H  -6.075313 1.176706 0.382341
H  -4.413902 1.265661 1.054734
H  -4.591505 -1.03558 1.959081
H  -6.243611 -0.419906 2.257711
H  -5.745833 -2.696692 0.631659
H  -7.145388 -1.600846 0.326924
H  -3.317723 -2.53996 -1.200071
H  2.771341 1.027319 1.082698
H  2.935475 1.416222 -0.655578
H  -1.632479 4.102856 0.626454
H  0.130774 3.938667 0.714527
H  4.82318 0.451338 -2.007957
H  4.412906 -0.520039 2.203968
H  7.135425 -0.514104 -2.008498
H  6.725477 -1.485582 2.209344
H  8.094524 -1.487113 0.101394
