program: Gaussian 09
title: 000243475
version: EM64L-G09RevD.01
frameworkgroup: C1[X(C16H18N6O4S)]
method: RPBEPBE
basis: SDD
operation: Freq
keyword: #p
keyword: freq=noraman
keyword: PBEPBE/SDD
title: #p freq=noraman PBEPBE/SDD
converged: YES YES NO NO
title: Mulliken charges:
elementType: S O O O O N N N N N N C C C C C C C C C C C C C C C C H H H H H H H H H H H H H H H H H H
charge: 0.255450 -0.254596 -0.442250 -0.475909 -0.501203 -0.191888 -0.068557 -0.068592 -0.049250 -0.590848 -0.000488 -0.169352 -0.090252 -0.175853 -0.003645 -0.399596 0.195021 -0.263109 0.104928 -0.361033 -0.043612 -0.802553 0.480463 -0.298849 -0.476627 -0.180606 -0.329379 0.265966 0.297153 0.244395 0.241494 0.246867 0.235438 0.347559 0.387247 0.333595 0.376384 0.287345 0.297217 0.329979 0.334614 0.253796 0.251129 0.230496 0.241509
chargesum: 0.00000
title: Mulliken charges with hydrogens summed into heavy atoms:
elementType: S O O O O N N N N N N C C C C C C C C C C C C C C C C
charge: 0.255450 -0.254596 -0.094691 -0.088662 -0.124819 -0.191888 -0.068557 -0.068592 -0.049250 0.073746 -0.000488 0.096614 0.206902 0.068542 0.237849 0.082709 0.195021 0.070486 0.104928 -0.361033 -0.043612 -0.217991 0.480463 -0.045053 -0.225499 0.049890 -0.087870
polarizability: 3.54272822e+02 -2.18390200e+01 2.63797171e+02 7.14394062e-01 -1.22729813e-01 1.66375549e+02
1716.lowfreq: -8.3973 -5.0018 -0.0015 0.0011 0.0018 3.1231 6.2126 12.1967 17.5279
frequency: 4.3268 12.1714 17.4194 28.0303 37.9087 45.4121 56.7597 83.9032 95.2933 115.6326 124.8888 140.4634 166.6405 182.6154 196.0699 215.7826 222.6518 239.4990 273.0028 275.8889 299.1032 315.3248 315.8885 320.4487 335.4665 367.2562 389.9676 393.7651 406.8134 441.5255 450.6955 457.0130 470.4633 508.0277 519.0307 560.7600 566.4647 595.2291 599.3712 619.5992 627.0518 653.1996 672.5150 709.1261 713.2171 721.3413 726.4357 732.8252 759.1235 787.0487 801.4660 803.1207 811.9478 827.8017 871.4012 874.8073 885.7880 891.3807 924.2757 926.9696 945.5850 946.8714 961.2310 963.1451 987.5723 991.0808 1006.4139 1013.9844 1023.4124 1028.3381 1040.4381 1073.1426 1094.6781 1099.3526 1104.1793 1137.2338 1162.1960 1170.7228 1180.9446 1195.0715 1195.8931 1212.0618 1225.8768 1234.8304 1256.5180 1261.9145 1274.1861 1279.2322 1292.3101 1305.6260 1311.4921 1314.5532 1325.8379 1338.3471 1339.8870 1358.5593 1366.0297 1375.9941 1404.3059 1414.0981 1417.7962 1433.1203 1447.0211 1459.2107 1477.8371 1496.4115 1507.6491 1556.7501 1571.8738 1586.5039 1606.3979 2995.5740 3001.7256 3028.3534 3030.4441 3065.3082 3073.2517 3075.5619 3120.3512 3130.1154 3138.0242 3142.1629 3166.0146 3206.9582 3359.5081 3564.7100 3571.7755 3602.8288 3724.0574
redmass: 6.0098 4.4272 5.2453 5.5665 6.3312 5.5080 8.2216 5.4303 5.2435 7.0050 6.7949 4.0942 6.3102 5.9904 5.2948 5.0501 7.8558 4.4667 2.0300 3.1541 2.8796 3.4917 3.5617 1.6126 2.2622 3.7127 3.9615 4.3399 6.1142 5.5470 1.3233 4.6153 5.1293 6.7738 1.0670 4.4128 6.4083 8.0094 7.3199 7.2458 6.8065 5.8005 6.0248 1.9538 7.9438 1.8070 2.3616 2.7927 6.2221 10.8475 6.0706 4.0324 4.1132 2.1292 4.4920 1.5629 6.4270 1.3555 1.3767 3.1124 1.5460 4.1836 3.3130 4.2065 1.3977 3.3082 3.6140 4.5437 2.9707 3.1466 2.2382 2.7394 2.5552 1.4816 2.5114 1.1311 2.4590 1.3862 1.1870 1.4296 1.4612 2.1390 1.2458 1.8870 1.3422 1.2344 1.1834 2.7393 1.3128 1.3317 8.3544 6.8276 4.1150 1.2300 1.4595 1.5014 6.4477 1.4662 1.5232 2.0641 1.4612 1.1659 3.5523 2.2053 1.0790 3.0617 8.9396 5.5443 10.0339 5.8725 1.5655 1.0857 1.0564 1.0869 1.0879 1.0584 1.1060 1.0897 1.0911 1.0881 1.0928 1.1079 1.1001 1.1014 1.0655 1.0441 1.0665 1.0670 1.1060
irintensity: 1.1264 2.7839 1.6876 0.0771 0.1699 4.0224 2.2738 3.0325 1.1438 1.5180 0.1560 10.4529 1.7681 6.7208 0.3146 21.2492 2.6171 14.9170 66.5906 25.0636 29.1295 3.5555 1.6227 78.1953 109.3414 10.2118 1.1041 9.8170 2.2843 20.6393 233.1283 65.0889 2.0089 1.9847 0.7548 5.8233 5.6352 0.2554 1.2081 4.3456 4.5130 10.2144 11.1025 63.7853 4.4110 37.7511 79.2764 63.0114 78.4064 12.1744 24.4718 45.6798 34.3355 19.5378 57.5718 3.1896 88.9133 22.8868 1.7467 64.5178 2.5139 24.6851 90.7796 13.2046 0.2029 88.9409 10.9673 136.1145 108.8959 0.1235 2.8963 4.2210 36.4643 4.0676 79.6790 4.2623 5.8819 60.5176 25.2504 6.0047 44.0981 145.7508 14.0814 0.6865 35.3547 11.0526 18.5375 30.9738 7.6726 27.0091 2.6524 75.8330 41.0200 1.2377 2.3421 13.4778 142.3024 11.9725 12.9196 17.3471 25.9208 29.9171 54.4520 28.2897 9.0896 190.3076 383.8553 5.8807 327.8248 0.6094 527.6836 35.7793 27.6497 36.8149 33.0806 4.0609 46.6489 14.9771 22.3056 0.6638 26.5338 2.9090 26.9508 68.5933 172.2103 146.1774 11.1242 13.4438 47.7965
temp: 298.150 k
press: 1.00000 atm
elementType: 16 8 8 8 8 7 7 7 7 7 7 6 6 6 6 6 6 6 6 6 6 6 6 6 6 6 6 1 1 1 1 1 1 1 1 1 1 1 1 1 1 1 1 1 1
symmnumber: 1
zpe: 890965.9 jmol-1
zpe.correction: 0.339351 hartree
zpe.thermalcorrener: 0.364361 hartree
zpe.thermalcorrenthalpy: 0.365305 hartree
zpe.thermalcorrgfe: 0.278844 hartree
zpe.sumelectzpe: -1645.962588 hartree
zpe.sumelectthermal: -1645.937579 hartree
zpe.sumelectthermalent: -1645.936635 hartree
zpe.sumelectthermalfe: -1646.023095 hartree
dipole: -6.4596 -1.8910 1.4862
dipole: 6.8928
quadrupole: -152.2493 -148.7171 -154.2342
quadrupole: 20.6338 17.2742 4.9997
quadrupole: -0.5158 3.0164 -2.5006 20.6338 17.2742 4.9997
hfenergy: -1646.3019394 hartree
pointgroup: C01 [X(C16H18N6O4S1)]
dipole: 2.5887477 -0.6061541 -0.5338315 debye
polarizability: 351.4298343|26.876988|266.5642792|3.3327965|-0.8538747|166.451429 unknown
InChI: InChI=1S/C16H18N6O4S/c17-16-20-13-10(14(21-16)27-6-8-2-1-3-18-4-8)19-7-22(13)15-12(25)11(24)9(5-23)26-15/h1-4,7,9,11-12,15,23-25H,5-6,17H2
charge 0 multiplicity 1
45 atoms
S  -3.169323 1.102501 0.374441
O  3.986142 0.450605 1.109913
O  5.201442 1.030504 -1.710757
O  3.879682 -2.279902 -0.753614
O  5.158427 -3.037814 1.480406
N  1.935532 0.574342 -0.183464
N  -0.075266 -0.534217 -0.17837
N  1.155867 2.86821 0.270888
N  -1.289183 2.98567 0.513527
N  0.048646 4.893442 0.712976
N  -6.329486 -2.543381 0.990827
C  4.165391 0.086968 -1.275956
C  3.375598 0.838899 -0.178256
C  4.785932 -1.144109 -0.568105
C  4.914258 -0.692913 0.916638
C  4.511253 -1.777947 1.92968
C  0.959205 1.545725 0.071954
C  1.250814 -0.656322 -0.317462
C  -0.291305 0.844687 0.067537
C  -1.436466 1.652457 0.303543
C  -0.025574 3.537762 0.491531
C  -3.089303 -0.779128 -0.014845
C  -4.503599 -1.293255 -0.086585
C  -5.328246 -1.062772 -1.218366
C  -5.061428 -2.038231 0.98564
C  -6.642637 -1.576139 -1.233555
C  -7.100589 -2.306563 -0.111776
H  3.521691 -0.236314 -2.115216
H  3.496003 1.929524 -0.286076
H  5.782409 -1.382779 -0.988777
H  5.939252 -0.328865 1.111682
H  3.410413 -1.885696 1.926786
H  4.853584 -1.503205 2.943558
H  5.707315 0.636263 -2.465245
H  4.233566 -3.007473 -0.161628
H  1.794157 -1.577664 -0.52406
H  5.126887 -3.716637 2.197493
H  -2.504018 -1.260803 0.780668
H  -2.54314 -0.890055 -0.962216
H  0.956958 5.348326 0.718133
H  -0.808966 5.410702 0.883155
H  -4.942513 -0.487327 -2.067622
H  -4.463478 -2.241885 1.882814
H  -7.302543 -1.416446 -2.09216
H  -8.115463 -2.719544 -0.083079
