program: Gaussian 09
title: 000243424
version: EM64L-G09RevD.01
frameworkgroup: C1[X(C14H12O)]
method: RPBEPBE
basis: SDD
operation: Freq
keyword: #pfreq=noraman
keyword: PBEPBE/SDD
title: #p freq=noraman PBEPBE/SDD
converged: YES YES NO NO
title: Mulliken charges:
elementType: O C C C C C C C C C C C C C C H H H H H H H H H H H H
charge: -0.250601 -0.583124 0.331160 -0.246102 -0.379823 0.019608 -0.230138 -0.305515 0.466487 -0.264052 -0.377543 -0.385242 -0.236649 -0.237969 -0.235641 0.248262 0.248066 0.242915 0.283142 0.247006 0.221886 0.267945 0.224994 0.238878 0.228226 0.231260 0.232564
chargesum: 0.00000
title: Mulliken charges with hydrogens summed into heavy atoms:
elementType: O C C C C C C C C C C C C C C
charge: -0.250601 -0.086796 0.331160 -0.003187 -0.096682 0.019608 0.016868 -0.083629 0.466487 0.003893 -0.152549 -0.146364 -0.008423 -0.006709 -0.003077
polarizability: 3.27827395e+02 -3.34626192e+00 1.59145772e+02 2.58144071e-02 7.61942293e-02 6.25038598e+01
1716.lowfreq: -5.4431 -0.3129 0.0004 0.0005 0.0009 3.4119 28.4169 51.9549 58.3370
frequency: 28.3867 51.9137 58.2943 95.4450 124.6085 170.2811 211.4032 224.0185 277.2351 302.0743 360.4105 402.6820 427.4593 490.2421 511.3336 519.2131 566.2033 614.9100 673.3146 696.4664 709.5494 747.1227 774.3927 809.1111 844.5935 847.2490 877.2847 888.0698 906.2251 925.8528 928.2012 960.5628 967.1433 979.6602 988.2149 996.9917 1016.2265 1017.7135 1023.4111 1039.5455 1083.5637 1090.4120 1099.1585 1173.8370 1190.4841 1192.6922 1218.2081 1238.1864 1280.6198 1304.8378 1327.0981 1336.9477 1360.1318 1386.3064 1391.6138 1439.7373 1483.9111 1497.8765 1512.8810 1579.4843 1580.7249 1609.4734 1638.4425 2975.3476 3020.5936 3092.8926 3124.2770 3125.0900 3129.4482 3141.0101 3151.4806 3167.1390 3168.6855 3188.1775 3204.3020
redmass: 4.1156 3.5061 4.8977 5.2931 3.4218 4.5474 3.2741 7.2910 3.0356 5.6511 1.6378 2.7612 6.1080 2.7825 4.8392 2.5302 6.6971 6.4351 3.0432 1.5456 1.3670 6.9183 1.9502 5.8913 4.5238 1.2845 1.8384 3.8206 1.8232 1.4419 1.5230 1.4208 1.7452 1.3869 6.1320 1.3172 1.5659 1.2131 2.3429 3.3982 1.6093 1.1365 1.2198 1.0646 1.1443 1.8243 1.4963 1.7033 2.6336 1.6965 2.0414 1.5948 2.1963 6.1749 1.1653 2.3039 2.3437 6.3258 9.1152 5.7893 5.6611 5.9394 5.6373 1.0613 1.0967 1.0893 1.0875 1.0877 1.0875 1.0916 1.0964 1.1016 1.0875 1.0968 1.1074
irintensity: 1.1085 0.0684 0.6275 0.5231 0.7387 0.6016 0.4955 0.9735 0.9234 6.1422 14.0070 0.0234 0.5978 13.7348 9.2808 1.5304 29.7936 0.1409 29.5012 5.7377 93.3500 21.5272 56.3347 22.2939 6.0045 0.3657 0.8392 2.3983 28.4060 2.5112 0.2160 0.4823 19.4958 0.1723 3.4001 3.5826 26.6576 38.7354 10.5489 114.6541 10.9206 0.7115 0.1091 0.9739 23.5337 90.3285 8.2273 53.9940 24.0882 17.1504 34.4785 94.1458 12.0227 24.8649 16.8104 24.7313 17.6755 212.4296 147.2483 97.7619 17.5898 2.3480 231.6829 5.5201 6.5406 0.5660 14.9861 0.5258 4.3017 5.6304 40.0821 33.9597 4.9841 7.4647 18.8857
temp: 298.150 k
press: 1.00000 atm
elementType: 8 6 6 6 6 6 6 6 6 6 6 6 6 6 6 1 1 1 1 1 1 1 1 1 1 1 1
symmnumber: 1
zpe: 559601.6 jmol-1
zpe.correction: 0.213141 hartree
zpe.thermalcorrener: 0.226005 hartree
zpe.thermalcorrenthalpy: 0.226950 hartree
zpe.thermalcorrgfe: 0.172109 hartree
zpe.sumelectzpe: -614.830383 hartree
zpe.sumelectthermal: -614.817518 hartree
zpe.sumelectthermalent: -614.816574 hartree
zpe.sumelectthermalfe: -614.871414 hartree
dipole: 0.8480 4.0230 -0.0075
dipole: 4.1114
quadrupole: -66.3014 -84.7759 -93.6039
quadrupole: -7.2493 0.0157 0.0331
quadrupole: 15.2590 -3.2155 -12.0435 -7.2493 0.0157 0.0331
hfenergy: -615.0435235 hartree
pointgroup: C01 [X(C14H12O1)]
dipole: 0.3461544 1.5761761 -0.1109187 debye
polarizability: 327.7465052|-4.8161931|158.796305|-1.8127565|-6.3087462|62.9342164 unknown
InChI: InChI=1S/C14H12O/c15-14(13-8-4-5-9-13)11-10-12-6-2-1-3-7-12/h1-8,10-11H,9H2
charge 0 multiplicity 1
27 atoms
O  -1.57066 -2.18468 0.198846
C  -2.922758 1.397215 -0.027888
C  -2.793545 -0.117923 0.070557
C  -4.418599 1.628311 -0.033091
C  -4.069281 -0.657594 0.110671
C  -1.542344 -0.906164 0.114202
C  -5.066221 0.412992 0.046186
C  -0.253827 -0.160046 0.055642
C  2.294306 -0.249028 0.037123
C  0.94413 -0.823237 0.086385
C  2.547525 1.151753 -0.059155
C  3.412193 -1.132348 0.086081
C  3.865478 1.644206 -0.104474
C  4.732748 -0.639821 0.041088
C  4.965464 0.751713 -0.054735
H  -2.44884 1.79938 -0.947315
H  -2.438015 1.916008 0.825023
H  -4.882411 2.61598 -0.093627
H  -4.278959 -1.727524 0.180071
H  -6.147617 0.258114 0.061019
H  -0.299152 0.933539 -0.01363
H  0.87567 -1.919728 0.156189
H  1.709084 1.855999 -0.09848
H  3.23292 -2.21188 0.160101
H  4.0424 2.723002 -0.178763
H  5.577358 -1.336279 0.080092
H  5.989754 1.138741 -0.090319
