program: Gaussian 09
title: 000243422
version: EM64L-G09RevD.01
frameworkgroup: C1[X(C10H5Cl3N2)]
method: RPBEPBE
basis: SDD
operation: Freq
keyword: #p
keyword: freq=noraman
keyword: PBEPBE/SDD
title: #p freq=noraman PBEPBE/SDD
converged: NO NO NO NO
title: Mulliken charges:
elementType: Cl Cl Cl N N C C C C C C C C C C H H H H H
charge: 0.043449 0.050681 0.043799 0.100941 0.165346 0.358929 0.141478 -0.360301 -0.360289 -0.162183 -0.213434 -0.213436 -0.230290 -0.166421 -0.387419 0.242712 0.242708 0.234143 0.234143 0.235446
chargesum: 0.00000
title: Mulliken charges with hydrogens summed into heavy atoms:
elementType: Cl Cl Cl N N C C C C C C C C C C
charge: 0.043449 0.050681 0.043799 0.100941 0.165346 0.358929 0.141478 -0.117589 -0.117581 -0.162183 0.020709 0.020707 0.005155 -0.166421 -0.387419
polarizability: 1.96843121e+02 6.52613919e+00 1.52813723e+02 -1.15406243e-02 1.68218039e-02 9.67253822e+01
1716.lowfreq: -48.4186 -7.4009 -0.0011 -0.0009 0.0011 2.0450 6.8092 43.5764 60.4963
frequency: -48.4037 43.5551 60.4958 84.5513 163.3918 179.6019 188.0013 235.0033 254.1616 277.3614 331.1061 336.0477 390.7761 392.8228 442.0873 536.2006 586.0830 600.4541 613.8643 628.4359 659.7693 701.1244 757.4111 784.4989 792.8448 807.9944 849.2507 923.9347 968.8867 974.6400 987.7504 999.4288 1024.6164 1081.7824 1100.2906 1175.8269 1190.5209 1212.5336 1235.0062 1248.4172 1314.3207 1342.6423 1372.5107 1429.2131 1446.0090 1477.5672 1497.8171 1587.1287 1612.3283 3130.1536 3135.7015 3145.8614 3156.4003 3170.2692
redmass: 4.0154 14.9619 7.5573 8.6840 12.6699 15.9457 26.3269 5.2178 8.8324 11.7394 27.7687 9.9679 16.8689 2.8193 5.3738 14.3323 4.9783 9.5186 7.5926 7.7272 10.6968 1.7169 3.0391 3.6671 11.6663 8.7304 1.2470 1.4227 11.8893 1.3915 6.2357 1.3254 2.5295 1.6076 4.0519 1.0525 1.1276 9.5283 12.2944 12.3259 1.3510 5.4407 7.2951 2.1931 7.0275 4.4509 4.7890 6.0250 6.1770 1.0850 1.0881 1.0928 1.0971 1.1019
irintensity: 0.0028 0.0029 0.4589 0.0146 0.0005 0.3421 0.2161 0.0331 0.4677 0.9903 0.3631 0.2561 3.3379 0.0112 0.4154 30.8248 28.6924 0.0199 0.2253 27.9496 0.2570 48.0022 112.6525 20.3722 1.2344 33.6485 0.0043 0.0040 10.1332 0.0002 3.7159 0.0007 7.1664 7.8903 24.7446 0.0106 5.2671 134.2158 74.0013 232.8181 0.6316 36.6511 0.0646 10.7425 296.6150 109.9782 93.5327 0.9985 0.5660 0.6377 0.0224 12.6543 27.9810 18.7662
temp: 298.150 k
press: 1.00000 atm
elementType: 17 17 17 7 7 6 6 6 6 6 6 6 6 6 6 1 1 1 1 1
symmnumber: 1
zpe: 326810.5 jmol-1
zpe.correction: 0.124476 hartree
zpe.thermalcorrener: 0.136523 hartree
zpe.thermalcorrenthalpy: 0.137467 hartree
zpe.thermalcorrgfe: 0.084285 hartree
zpe.sumelectzpe: -1872.686051 hartree
zpe.sumelectthermal: -1872.674003 hartree
zpe.sumelectthermalent: -1872.673059 hartree
zpe.sumelectthermalfe: -1872.726242 hartree
dipole: -3.5115 -1.1779 0.0006
dipole: 3.7038
quadrupole: -101.7102 -114.7491 -98.4996
quadrupole: -1.7190 0.0006 0.0089
quadrupole: 3.2761 -9.7628 6.4867 -1.7190 0.0006 0.0089
hfenergy: -1872.8105266 hartree
pointgroup: C01 [X(C10H5Cl3N2)]
dipole: -1.3644684 0.5115177 -0.000236 debye
dipolederiv: -0.1937628 0.2762215 -0.0000656 0.3127533 -0.6082919 0.0001264 -0.0000348 0.0001092 0.0059801 -0.4153787 -0.4190363 0.0000077 -0.4389053 -0.5766707 0.0000218 0.0000081 -0.000011 -0.0354078 -0.2955166 0.3504473 -0.000088 0.4045111 -0.7637276 0.0001688 -0.0001378 0.0002148 -0.0392701 -0.9587587 0.4558723 -0.000183 0.1896841 -0.6600555 0.0001059 -0.0000321 0.0001626 -0.1229652 -0.4637986 0.0155118 -0.0000179 0.0392467 -1.3207342 0.0001961 -0.0001233 0.0001777 -0.0962936 -0.0533548 0.0586601 -0.0000215 -0.0335685 -0.0675345 0.0000322 -0.0000216 0.0000186 -0.0135471 1.1281095 0.0305715 0.0000909 0.2725113 0.4049411 -0.0000877 0.0000531 -0.0000806 0.0436582 -0.1040984 -0.0201316 -0.093234 -0.0141459 -0.1024303 0.0042807 0.102161 0.0035249 0.0559161 -0.1041132 -0.0199876 0.0932062 -0.0147264 -0.1024663 -0.0039695 -0.1021499 -0.003302 0.0559096 -0.4797232 -0.6915179 0.000069 -0.7291848 0.5266269 -0.000175 -0.0000826 -0.0001489 0.0241182 -0.0350987 -0.0056242 0.1074786 -0.0045646 -0.1336131 0.000334 0.0563886 -0.0072718 0.0702343 -0.0350693 -0.0057915 -0.1074866 -0.0046031 -0.1335895 -0.0000232 -0.0564047 0.0076012 0.070201 0.1257957 -0.0094901 0.0000178 -0.0048118 -0.1499468 0.0000773 0.000025 0.0000807 -0.046479 0.9798824 0.5735999 0.0000244 0.6356518 1.1620064 -0.0000543 0.0000024 -0.0000657 0.0565357 0.9084268 -0.5953346 0.0002024 -0.6344497 1.7875563 -0.000369 0.0003731 -0.0003996 0.0436202 0.0564463 0.0058104 0.09127 0.0053386 0.1350529 0.0008694 0.0858366 0.0024207 -0.0238252 0.056457 0.0056664 -0.0912581 0.0052203 0.1350362 -0.0011511 -0.0858428 -0.0026514 -0.023862 0.0069331 -0.0033607 -0.0803606 0.0047978 0.1545959 0.0015696 -0.0949604 -0.0008679 -0.057508 0.0069082 -0.0032397 0.0803692 0.0049961 0.1545944 -0.0019014 0.0949629 0.00054 -0.0574777 -0.1302858 0.001153 -0.0000206 0.0042491 0.1586503 -0.000051 -0.0000209 -0.0000515 0.0904623 unknown
polarizability: 196.3321771|-8.0514575|153.3246666|0.0121228|0.0164072|96.7253822 unknown
InChI: InChI=1S/C10H5Cl3N2/c11-7-8(6-4-2-1-3-5-6)14-10(13)15-9(7)12/h1-5H
charge 0 multiplicity 1
20 atoms
Cl 0.229734 2.650253 -0.000321
Cl 3.505673 2.326445 0.000095
Cl 2.98172 -3.009049 0.000796
N  0.836794 -1.38405 0.000248
N  3.010976 -0.321714 0.000338
C  -1.27173 -0.124574 -0.000086
C  0.224763 -0.15558 0.00005
C  -1.981061 -0.120057 -1.226016
C  -1.981259 -0.118124 1.225722
C  1.010748 1.033043 -0.000048
C  -3.393402 -0.106686 -1.223588
C  -3.393599 -0.104776 1.223047
C  -4.102388 -0.098288 -0.000333
C  2.420915 0.885642 0.000093
C  2.186246 -1.392958 0.000351
H  -1.434111 -0.130886 -2.175273
H  -1.434462 -0.127437 2.175084
H  -3.9372 -0.104821 -2.174354
H  -3.937549 -0.101425 2.173723
H  -5.197808 -0.088158 -0.00043
