program: Gaussian 09
title: 000243400
version: EM64L-G09RevD.01
frameworkgroup: C1[X(C7H13ClO2)]
method: RPBEPBE
basis: SDD
operation: Freq
keyword: #p
keyword: freq=noraman
keyword: PBEPBE/SDD
title: #p freq=noraman PBEPBE/SDD
converged: YES YES NO NO
title: Mulliken charges:
elementType: Cl O O C C C C C C C H H H H H H H H H H H H H
charge: -0.016367 -0.295292 -0.214598 0.070798 -0.417199 -0.406937 -0.694802 -0.695155 0.350849 -0.698407 0.237868 0.227516 0.200477 0.207375 0.240118 0.219399 0.228923 0.211615 0.219531 0.225866 0.221763 0.287795 0.288863
chargesum: 0.00000
title: Mulliken charges with hydrogens summed into heavy atoms:
elementType: Cl O O C C C C C C C
charge: -0.016367 -0.295292 -0.214598 0.308666 0.010794 0.040556 -0.034866 -0.027994 0.350849 -0.121749
polarizability: 1.13099173e+02 6.12023942e-01 7.91157048e+01 -4.62815927e+00 -1.79056036e+00 7.82451707e+01
1716.lowfreq: -8.1206 0.0018 0.0027 0.0027 3.5210 9.4744 16.2802 49.2107 64.5460
frequency: 16.1079 49.0811 64.4920 88.4079 110.0646 118.8701 182.6849 207.2720 221.4966 246.4767 272.1333 312.4774 393.6883 416.2007 533.4113 587.6068 647.8458 703.1130 762.7579 772.3596 834.4525 857.7762 913.4000 916.1190 929.1386 1020.4795 1031.8041 1048.6931 1106.0332 1111.4426 1126.9420 1151.1898 1175.4872 1255.7493 1268.3689 1281.7756 1288.7794 1331.4400 1350.7147 1370.1576 1391.4317 1394.2147 1423.3607 1455.5512 1467.8581 1476.8086 1480.4069 1485.1289 1488.7167 1665.8678 2982.6974 2984.7281 2988.1713 2991.2191 3013.5393 3041.7709 3048.5827 3059.6418 3079.4351 3083.3941 3087.4706 3088.6758 3135.2965
redmass: 4.2066 6.2089 2.9983 2.5926 1.7708 4.1492 1.4627 2.7815 1.3661 2.9391 3.0109 3.3509 2.9025 2.8901 2.9511 3.1292 6.7239 3.2376 2.0699 1.3852 2.0212 2.4270 3.0920 2.2831 2.0515 1.3454 1.4085 2.6758 2.1138 2.6964 2.3998 1.1213 2.0144 1.2038 1.1785 1.4113 1.3511 1.3268 1.5180 1.5112 1.2110 1.2300 1.0878 1.0761 1.0726 1.0430 1.0442 1.0549 1.0558 10.6559 1.0374 1.0602 1.0395 1.0594 1.0858 1.0986 1.0985 1.0571 1.0996 1.0993 1.1004 1.1002 1.1074
irintensity: 2.6653 1.3819 5.2040 0.0966 0.9146 2.0653 0.4824 0.6798 1.9009 2.6625 5.1492 0.9771 6.3156 1.4469 2.5950 0.6369 6.5766 15.3708 10.7439 1.3514 27.4702 30.0849 53.1396 37.1956 38.3689 4.5115 3.3328 18.1097 132.0900 133.8279 131.9048 4.7253 3.6506 1.8608 0.6560 27.9076 0.3348 5.1985 3.1019 0.2702 8.3098 26.9274 30.3772 5.9590 8.1032 16.2624 6.7508 11.5336 12.3281 147.5667 34.9153 18.1290 14.8685 34.7485 13.3995 5.3993 15.3228 8.6261 37.1603 54.0796 22.9091 66.4587 1.9790
temp: 298.150 k
press: 1.00000 atm
elementType: 17 8 8 6 6 6 6 6 6 6 1 1 1 1 1 1 1 1 1 1 1 1 1
symmnumber: 1
zpe: 498785.7 jmol-1
zpe.correction: 0.189977 hartree
zpe.thermalcorrener: 0.202574 hartree
zpe.thermalcorrenthalpy: 0.203518 hartree
zpe.thermalcorrgfe: 0.148763 hartree
zpe.sumelectzpe: -884.237040 hartree
zpe.sumelectthermal: -884.224444 hartree
zpe.sumelectthermalent: -884.223500 hartree
zpe.sumelectthermalfe: -884.278255 hartree
dipole: 3.6027 0.2722 -2.0437
dipole: 4.1509
quadrupole: -71.8103 -66.0896 -70.6140
quadrupole: -0.7478 5.8979 0.5882
quadrupole: -2.3057 3.4151 -1.1094 -0.7478 5.8979 0.5882
hfenergy: -884.4270177 hartree
pointgroup: C01 [X(C7H13Cl1O2)]
dipole: -1.4087371 -0.0803803 0.8221995 debye
dipolederiv: -0.4647588 -0.0618109 0.0362011 -0.0462758 -0.1426885 0.0071935 0.0923583 0.0206525 -0.139011 -1.8222629 -0.2584984 0.1841059 -0.211375 -0.4443251 -0.0489009 0.0977661 -0.067336 -0.4696809 -0.6708173 -0.0794449 0.0115929 0.021159 -0.3379099 -0.1668281 0.3079664 -0.1101182 -0.7914064 0.9057288 0.1156309 0.0150265 0.194948 0.403839 0.0091672 0.3118427 0.0684935 0.194508 -0.0010268 0.0035082 0.0303909 0.0038206 -0.0030357 -0.0011915 0.0175991 -0.0365359 0.1192199 -0.0079729 0.0406012 0.0243106 0.0108354 -0.0283158 -0.0226755 -0.0433317 -0.0185044 0.0876536 0.0440398 0.0272852 0.0017097 0.0001752 -0.0532374 0.0047271 0.0225549 0.0019043 0.0820539 0.0927991 -0.0191458 0.0051886 -0.0153292 -0.0047406 0.0515196 -0.0036336 0.0364379 -0.0433503 1.7275837 0.2697411 -0.169934 0.1540128 0.2945494 0.2516031 -0.3476276 0.2061515 1.0087517 0.4969977 0.0259383 -0.1919989 -0.0333955 0.1328054 -0.0895366 -0.4025979 -0.1455807 -0.0178432 -0.0072188 -0.0320897 0.046037 -0.0468747 -0.0025848 0.0704552 -0.0577246 0.0461539 -0.0803192 0.0872282 0.0078389 -0.0090184 0.0211017 0.0393497 0.0575915 0.0369125 0.0622114 -0.1301542 -0.1092564 -0.0932058 -0.0497956 -0.0757744 -0.0115002 -0.0478582 -0.076114 -0.0516837 0.0509935 -0.0600027 -0.0725065 -0.1254897 -0.089239 0.0418352 -0.005657 -0.1007146 -0.0038432 -0.0445331 -0.0552034 0.0957524 0.0871124 0.0742576 0.0147279 -0.0029117 0.0788978 0.0055603 0.0191947 -0.0908493 0.1325797 0.0822749 0.1087499 -0.0135885 -0.0316316 0.0921366 -0.0514271 0.0605815 -0.0527849 -0.1258304 -0.076877 -0.0901274 0.0360597 -0.0117749 -0.0788601 -0.0357 0.0522025 0.0983441 -0.0101557 0.0152009 -0.0024829 0.0488078 0.010583 -0.0129501 0.0747975 -0.1639137 0.0958613 0.0166376 0.0047909 -0.0110213 -0.200013 0.0392111 0.012195 0.0062503 0.078561 -0.0266141 -0.0416367 -0.1122629 -0.0500169 0.0892294 -0.076469 -0.0950466 -0.0326021 -0.018995 -0.1234317 0.0547023 0.0937614 0.0871041 0.0907301 -0.0366365 0.0679378 -0.0131496 0.0300194 -0.0194498 -0.0383941 0.0417937 -0.015722 0.0512419 0.0904751 0.0311564 0.0707639 0.0198095 -0.0369328 0.0425034 0.0558791 0.0114699 -0.0012359 -0.0504551 0.049277 -0.032896 0.0956581 unknown
polarizability: 111.9245163|5.5408101|80.4502577|-5.6755036|0.5245095|78.085274 unknown
InChI: InChI=1S/C7H13ClO2/c1-3-6(4-2)10-7(9)5-8/h6H,3-5H2,1-2H3
charge 0 multiplicity 1
23 atoms
Cl 3.960157 0.983295 0.005453
O  -0.00431 0.33067 0.371633
O  1.429952 -0.042687 -1.442428
C  -1.198595 -0.158992 -0.426931
C  -2.408672 0.593168 0.144191
C  -1.266607 -1.696749 -0.337501
C  -2.37873 2.106027 -0.155052
C  -1.499613 -2.257013 1.082152
C  1.233625 0.320344 -0.267464
C  2.261277 0.830086 0.741248
H  -1.01201 0.135353 -1.478401
H  -2.458561 0.425263 1.235992
H  -3.320256 0.137787 -0.2918
H  -2.0837 -2.027482 -1.010078
H  -0.331459 -2.109116 -0.760626
H  -3.259218 2.61373 0.277901
H  -1.473051 2.570454 0.273448
H  -2.378236 2.299033 -1.244149
H  -1.454392 -3.360662 1.072309
H  -0.729042 -1.890637 1.783775
H  -2.48801 -1.967029 1.48143
H  2.332578 0.132499 1.589473
H  1.968269 1.824157 1.109724
