program: Gaussian 09
title: 000243401
version: EM64L-G09RevD.01
frameworkgroup: C1[X(C8H15ClO2)]
method: RPBEPBE
basis: SDD
operation: Freq
keyword: #p
keyword: freq=noraman
keyword: PBEPBE/SDD
title: #p freq=noraman PBEPBE/SDD
converged: YES YES NO NO
title: Mulliken charges:
elementType: Cl O O C C C C C C C C H H H H H H H H H H H H H H H
charge: -0.034132 -0.246978 -0.234242 -0.027348 -0.363549 -0.379224 -0.343408 -0.712897 -0.695821 0.359986 -0.672906 0.191760 0.187484 0.209803 0.253018 0.218755 0.186106 0.236691 0.237467 0.205452 0.214104 0.203407 0.218575 0.216225 0.286404 0.285269
chargesum: 0.00000
title: Mulliken charges with hydrogens summed into heavy atoms:
elementType: Cl O O C C C C C C C C
charge: -0.034132 -0.246978 -0.234242 0.164412 0.033738 0.043572 0.128365 -0.055874 -0.057614 0.359986 -0.101234
polarizability: 1.01187533e+02 -2.81819161e+00 1.01362510e+02 6.08880461e-01 8.51553582e-01 9.71929484e+01
1716.lowfreq: -14.2891 -0.0003 0.0006 0.0028 3.9621 9.3405 14.3286 37.3701 48.5750
frequency: 12.6293 37.2328 48.4140 65.6488 92.6689 124.0500 168.4209 184.0286 221.3189 224.4364 233.2386 258.8173 331.9629 384.9639 387.6743 442.4037 528.7069 589.5941 643.4358 736.7546 746.6427 774.6541 812.4278 859.9846 892.5565 914.2727 936.6113 947.2667 963.8898 1001.8011 1046.9165 1087.7271 1104.9669 1109.0030 1146.8341 1168.3888 1221.0911 1231.0290 1249.8423 1263.1467 1271.5627 1300.0298 1324.8826 1328.1870 1358.0425 1360.6329 1387.0740 1388.8697 1429.7326 1463.1386 1470.0180 1474.8730 1475.4936 1478.7268 1484.0653 1489.1676 1634.9844 2949.4623 2964.0806 2971.9612 2972.8511 2979.2237 3013.0718 3030.9134 3037.6425 3070.2613 3071.5889 3073.9014 3086.1201 3086.6312 3101.4697 3182.5336
redmass: 5.0527 4.2799 4.5111 4.2720 2.0611 2.5571 2.5959 4.5621 1.1571 1.5543 1.9401 4.8908 2.3849 2.9987 2.6537 2.3307 4.4958 3.3611 6.3080 6.8619 1.1529 3.4878 2.4662 1.3332 1.9133 2.1608 2.0618 1.9358 1.8412 1.4646 2.4227 2.3177 1.3754 1.5269 2.1097 2.1423 1.4605 1.9507 1.1759 1.2369 1.2561 1.1465 1.5243 1.4803 1.3318 1.4685 1.2167 1.2179 1.1060 1.0834 1.0683 1.0478 1.0526 1.0490 1.0644 1.0816 9.3813 1.0811 1.0606 1.0595 1.0388 1.0367 1.0960 1.0580 1.1010 1.1006 1.0992 1.0995 1.0566 1.0995 1.1086 1.1122
irintensity: 0.7369 1.0722 1.5462 0.6224 0.6671 1.0415 0.3599 1.8972 0.8074 2.0330 4.0656 6.2491 4.3211 4.2929 1.4514 1.2963 12.5138 13.7575 21.0084 2.3473 10.6115 4.2355 2.8934 4.6714 4.5806 17.2433 36.8369 9.4506 35.1630 0.5285 3.5964 3.5923 96.6774 5.0051 2.0288 5.1080 30.0635 113.1645 25.2389 16.1628 6.9653 0.7285 6.1442 2.8818 2.8282 2.2785 14.3136 15.3691 17.6148 15.2588 0.3934 5.5638 18.4583 4.6439 7.1252 22.6888 180.6916 19.6995 8.3494 37.3680 56.5261 34.5942 6.7294 38.7701 19.7912 51.8712 56.4677 50.2807 11.8494 33.9762 13.3349 1.8691
temp: 298.150 k
press: 1.00000 atm
elementType: 17 8 8 6 6 6 6 6 6 6 6 1 1 1 1 1 1 1 1 1 1 1 1 1 1 1
symmnumber: 1
zpe: 573649.1 jmol-1
zpe.correction: 0.218491 hartree
zpe.thermalcorrener: 0.232242 hartree
zpe.thermalcorrenthalpy: 0.233186 hartree
zpe.thermalcorrgfe: 0.175290 hartree
zpe.sumelectzpe: -923.455970 hartree
zpe.sumelectthermal: -923.442220 hartree
zpe.sumelectthermalent: -923.441275 hartree
zpe.sumelectthermalfe: -923.499171 hartree
dipole: 0.4932 -2.1332 0.4765
dipole: 2.2407
quadrupole: -68.0972 -75.6189 -78.7947
quadrupole: -0.2687 -3.2873 -3.4135
quadrupole: 6.0731 -1.4486 -4.6244 -0.2687 -3.2873 -3.4135
hfenergy: -923.6744613 hartree
pointgroup: C01 [X(C8H15Cl1O2)]
dipole: -0.0563037 -0.8300139 -0.2916442 debye
dipolederiv: -0.2470747 0.013156 0.0400735 -0.0145408 -0.1608057 -0.0747047 -0.0527462 -0.0831461 -0.3987501 -0.9430648 -0.4865449 -0.1519685 -0.5639095 -0.9581079 -0.0250653 -0.1509488 -0.0451816 -0.4039526 -0.4902894 0.0070795 -0.1900213 -0.2406958 -0.7477425 0.1674314 0.0461672 0.3443269 -0.5994868 0.0964236 0.0249888 0.0282192 0.02419 0.0911044 -0.0098316 -0.0247857 -0.0233144 0.0920513 0.1251519 0.0323453 -0.006636 0.014888 -0.0355721 0.013768 0.0350132 0.0213368 0.0207137 0.1516283 0.0242448 0.055552 0.0469829 0.0092791 0.0165727 0.0361277 -0.0004122 0.06553 0.6145037 0.1918791 0.0933379 0.0792185 0.2494535 0.0796956 0.2242205 0.2343021 0.2506611 0.0348483 0.0147692 -0.0009577 0.0419542 -0.0124574 0.0824546 0.0104866 0.040309 -0.0070096 0.079801 0.0441004 -0.0120347 0.0367826 -0.0360598 -0.032553 -0.0114094 -0.0094533 0.0633043 0.7419497 0.4311642 0.456093 0.7676348 1.365554 -0.1813827 0.1628689 -0.3824649 0.708188 0.1741719 -0.0852579 -0.2255282 -0.0711176 0.1620022 0.089847 -0.2143386 0.0832098 0.332742 -0.0946937 -0.0736793 -0.125655 -0.0334369 0.0351493 -0.0238671 -0.0802111 -0.0338092 -0.0729913 -0.1137213 -0.0156836 0.1337453 -0.0024249 0.0509903 0.0160558 0.1196938 0.0215313 -0.0312651 -0.0192126 -0.0394025 -0.1094512 -0.0355995 0.0088734 -0.0267904 -0.0968234 -0.0208388 -0.0168663 0.0322415 -0.0712363 -0.0000682 -0.0155137 0.0499844 0.1335945 -0.0538643 0.0376381 -0.0177208 -0.024087 0.0332918 0.0039074 0.044167 -0.1134924 -0.1222548 -0.0378023 -0.0813195 0.0575465 -0.0614338 -0.0402102 -0.1387599 -0.0734542 -0.0164482 -0.0867491 -0.1136608 -0.0498906 -0.0467927 -0.0414039 -0.0147728 0.1151388 -0.0166435 0.0480343 -0.000154 0.1026274 0.0012323 -0.0062958 0.0007957 -0.0092493 -0.1170554 -0.0497944 0.0780559 -0.0545139 -0.0965119 -0.0158575 -0.0065148 0.0857401 0.0703978 0.0167746 0.0533722 -0.1815179 -0.0428783 0.0093783 -0.100155 0.0343774 -0.1195083 -0.0383868 0.1233721 0.0110284 0.0867864 0.0035332 0.1136532 0.0343453 0.0142404 -0.1058678 0.0067358 0.123288 -0.0517938 0.0578994 0.0292664 0.1411327 -0.0227249 0.0027673 -0.0436998 -0.0816761 -0.11415 -0.0377897 0.0491881 -0.0477551 -0.0939544 -0.0850079 -0.0142888 0.0759849 0.0590184 -0.0269718 0.0708764 -0.1011964 0.113156 -0.0480052 0.1500245 -0.0369851 0.027048 -0.0481092 0.0275965 -0.0860188 0.0293286 -0.0098717 0.0590674 0.0090179 -0.0048686 0.0637684 0.0510379 0.0021595 0.1016381 -0.0082829 -0.0070035 0.0146252 -0.0236983 0.0216666 unknown
polarizability: 99.9436793|2.7196185|101.7802507|1.8564866|0.4690727|98.0190619 unknown
InChI: InChI=1S/C8H15ClO2/c1-3-4-7(2)6-11-8(10)5-9/h7H,3-6H2,1-2H3
charge 0 multiplicity 1
26 atoms
Cl 1.754814 0.861711 2.475828
O  0.80055 -1.0130 -0.069477
O  1.157687 1.065372 -1.092572
C  -1.678175 -1.297065 -0.104503
C  -2.025877 0.109386 0.453988
C  -2.322412 1.187479 -0.614684
C  -0.383483 -1.310148 -0.941868
C  -1.621129 -2.352819 1.025563
C  -2.770973 2.524264 0.015666
C  1.431731 0.211268 -0.218749
C  2.525065 0.365189 0.824484
H  -2.480743 -1.588552 -0.818524
H  -2.917291 0.002279 1.105511
H  -1.205752 0.454224 1.116363
H  -0.404583 -0.573574 -1.763036
H  -0.179158 -2.319273 -1.338024
H  -3.11424 0.816739 -1.298628
H  -1.421208 1.367515 -1.231469
H  -0.823459 -2.104184 1.747772
H  -1.41596 -3.36447 0.627322
H  -2.580924 -2.390476 1.5719
H  -3.687898 2.393291 0.621443
H  -1.983961 2.929109 0.679228
H  -2.981512 3.284265 -0.758908
H  3.204906 1.179972 0.54779
H  3.049885 -0.581001 1.010786
