program: Gaussian 09
title: 000243387
version: EM64L-G09RevD.01
frameworkgroup: C1[X(C12H7N5O4)]
method: RPBEPBE
basis: SDD
operation: Freq
keyword: #p
keyword: freq=noraman
keyword: PBEPBE/SDD
title: #p freq=noraman PBEPBE/SDD
converged: NO YES YES YES
title: Mulliken charges:
elementType: O O O O N N N N N C C C C C C C C C C C C H H H H H H H
charge: -0.193160 -0.168682 -0.191993 -0.185256 -0.221840 0.001928 -0.067459 0.011244 0.017342 -0.114931 0.138700 0.459380 -0.506966 0.494316 0.413830 -0.545568 -0.344152 -0.347373 -0.191949 -0.190660 -0.231343 0.316356 0.340045 0.299180 0.286117 0.241762 0.239831 0.241299
chargesum: 0.00000
title: Mulliken charges with hydrogens summed into heavy atoms:
elementType: O O O O N N N N N C C C C C C C C C C C C
charge: -0.193160 -0.168682 -0.191993 -0.185256 -0.221840 0.001928 -0.067459 0.011244 0.017342 -0.114931 0.138700 0.459380 -0.190609 0.494316 0.413830 -0.205523 -0.044972 -0.061256 0.049813 0.049172 0.009955
polarizability: 3.88687760e+02 1.81988539e+00 2.08463470e+02 -2.93467330e-03 6.10951966e-03 6.53538908e+01
1716.lowfreq: -5.5176 -5.4169 -0.0009 0.0005 0.0007 1.3150 35.8982 39.2484 48.4126
frequency: 35.8924 39.2401 48.4049 58.0489 79.7987 121.1015 139.1296 141.3258 204.5563 214.5194 252.4899 298.7018 332.7905 341.1725 348.0254 373.0151 404.3145 464.2221 479.6329 509.7800 513.5585 563.5262 564.6432 610.3957 653.4447 661.6944 690.4755 692.4626 692.9877 696.9716 716.5934 740.5916 777.0950 782.4808 823.0671 853.5211 894.5624 905.8157 944.4779 948.5076 968.5844 988.3098 992.0471 1001.2980 1007.7369 1018.7668 1052.4532 1066.6866 1078.7412 1116.2710 1176.7363 1180.0853 1184.5884 1198.5796 1208.4374 1273.9958 1284.6993 1315.1514 1325.8370 1353.4136 1379.2366 1390.9803 1394.7354 1453.7322 1470.2337 1475.2167 1497.0082 1565.9504 1598.2889 1604.1988 1621.2341 3142.2861 3155.1538 3169.3759 3185.2769 3187.3318 3189.2841 3195.6889
redmass: 12.1958 4.3882 9.2413 11.8891 7.1349 7.2926 8.9522 13.4329 7.5757 5.4818 8.7318 5.3961 10.5312 10.6258 8.1083 9.0462 2.8835 11.7436 4.6823 8.9191 4.1547 7.7440 4.9661 6.4516 9.2955 8.0481 2.5908 4.5081 7.9551 5.9040 6.4410 12.8510 1.6898 6.3459 6.9836 1.2456 9.4270 12.0411 1.5157 1.3958 1.4460 6.2537 1.3716 6.0890 1.3285 2.6605 2.8268 2.0700 2.6695 2.6837 1.0693 1.6639 1.2169 7.8610 7.1532 8.8644 4.2505 5.2887 1.3718 4.6064 13.7115 7.5263 10.4624 2.3725 5.2203 2.6269 8.3497 9.2727 6.8780 6.0277 9.2900 1.0863 1.0907 1.0957 1.0954 1.0915 1.0986 1.0940
irintensity: 0.0001 0.0040 0.0577 0.2490 0.1771 4.9321 2.2284 3.0587 0.3814 1.7529 0.0830 0.5466 1.6872 0.6118 0.0032 1.1311 0.0004 1.3139 0.0315 3.9719 11.5877 1.8568 0.0148 0.0755 16.5129 10.8012 58.7945 0.0027 14.9445 11.6974 6.0418 38.6364 68.7427 0.0001 4.7603 0.0128 24.6878 0.9615 18.7297 8.3588 26.2728 2.9603 0.0015 6.9632 0.8238 23.1080 34.1963 40.4251 17.8476 34.7421 0.3281 1.8362 32.3289 343.2224 302.7437 55.7011 3.5321 0.1806 1.0110 21.4883 74.4999 126.7319 3.9444 14.7122 16.4905 40.2726 66.3652 17.3835 2.1071 8.8917 49.3087 0.0458 12.8109 22.7431 0.3779 34.5111 10.5152 11.0530
temp: 298.150 k
press: 1.00000 atm
elementType: 8 8 8 8 7 7 7 7 7 6 6 6 6 6 6 6 6 6 6 6 6 1 1 1 1 1 1 1
symmnumber: 1
zpe: 484970.1 jmol-1
zpe.correction: 0.184715 hartree
zpe.thermalcorrener: 0.200874 hartree
zpe.thermalcorrenthalpy: 0.201818 hartree
zpe.thermalcorrgfe: 0.138930 hartree
zpe.sumelectzpe: -1034.476260 hartree
zpe.sumelectthermal: -1034.460101 hartree
zpe.sumelectthermalent: -1034.459157 hartree
zpe.sumelectthermalfe: -1034.522045 hartree
dipole: 7.4106 -2.6607 -0.0001
dipole: 7.8738
quadrupole: -117.0026 -134.8568 -119.1451
quadrupole: -4.6648 0.0074 0.0060
quadrupole: 6.6656 -11.1886 4.5230 -4.6648 0.0074 0.0060
hfenergy: -1034.660975 hartree
pointgroup: C01 [X(C12H7N5O4)]
dipole: 2.9083452 1.06666 -0.0009268 debye
polarizability: 388.7041913|-0.5895664|208.4470164|-0.0720964|-0.0314135|65.3539136 unknown
InChI: InChI=1S/C12H7N5O4/c18-16(19)9-6-10-12(11(7-9)17(20)21)14-15(13-10)8-4-2-1-3-5-8/h1-7H
charge 0 multiplicity 1
28 atoms
O  -2.907988 -3.306446 0.001417
O  -0.624089 -3.359934 0.001048
O  -4.232033 2.853656 -0.000279
O  -5.302293 0.837619 0.000001
N  1.509144 0.288452 -0.000624
N  0.835009 -0.926821 0.000032
N  0.750694 1.429425 -0.000373
N  -1.749703 -2.734028 0.000538
N  -4.237076 1.563731 0.000464
C  -0.481881 -0.525884 0.000042
C  -0.538576 0.92684 -0.000084
C  -1.712255 -1.254289 0.000305
C  -1.756484 1.641806 0.000037
C  -2.92346 0.86756 0.0003
C  2.942672 0.329603 -0.001107
C  -2.923056 -0.558294 0.00043
C  3.66428 -0.888205 -0.001118
C  3.597298 1.584356 -0.001519
C  5.072644 -0.838494 -0.00157
C  5.005965 1.611809 -0.001964
C  5.747099 0.405702 -0.001995
H  -1.804318 2.733019 -0.000061
H  -3.868823 -1.106721 0.000666
H  3.12262 -1.837299 -0.000781
H  3.007268 2.504138 -0.001488
H  5.64311 -1.772727 -0.001588
H  5.525565 2.57536 -0.002287
H  6.841668 0.435665 -0.002341
