program: Gaussian 09
title: 000243427
version: EM64L-G09RevD.01
frameworkgroup: C1[X(C15H14N2O3S)]
method: RPBEPBE
basis: SDD
operation: Freq
keyword: #p
keyword: freq=noraman
keyword: PBEPBE/SDD
title: #p freq=noraman PBEPBE/SDD
converged: YES YES NO NO
title: Mulliken charges:
elementType: S O O O N N C C C C C C C C C C C C C C C H H H H H H H H H H H H H H
charge: 0.853918 -0.502366 -0.532222 -0.182485 -0.030596 -0.062371 -0.426489 -0.035944 0.215645 -0.228238 -0.240950 -0.777144 -0.205498 -0.201108 -0.213691 0.159324 -0.271973 -0.321705 -0.202889 -0.200892 -0.224455 0.314534 0.282537 0.281386 0.278536 0.240577 0.252778 0.241307 0.242080 0.237812 0.287426 0.262961 0.235419 0.238514 0.236263
chargesum: 0.00000
title: Mulliken charges with hydrogens summed into heavy atoms:
elementType: S O O O N N C C C C C C C C C C C C C C C
charge: 0.853918 -0.502366 -0.532222 -0.182485 -0.030596 -0.062371 -0.111956 -0.035944 0.215645 0.054299 0.040436 -0.005254 0.035809 0.040972 0.024121 0.159324 0.015453 -0.058744 0.032530 0.037622 0.011808
polarizability: 3.77002400e+02 -2.50294991e+01 2.19390009e+02 -7.31114555e+00 -2.23566976e+01 1.59070604e+02
1716.lowfreq: -7.0223 -3.7235 -0.0013 -0.0009 0.0018 6.4337 11.4744 25.3574 33.7434
frequency: 10.5197 25.2204 33.7208 40.4637 49.5025 65.5877 85.1415 104.8793 129.0034 143.4440 157.7624 169.3855 176.5960 183.2881 221.8080 244.6378 273.2239 286.8437 329.8445 364.5270 369.1884 403.5711 404.2232 405.5138 416.5675 472.3016 496.1773 517.1250 589.3993 601.1642 604.2513 610.1548 652.0377 656.0301 686.1462 687.9220 759.1767 785.2066 788.1091 809.9558 846.3472 856.2147 912.1896 927.9324 934.4391 953.6229 956.9756 974.0595 983.9638 984.8044 994.1120 1000.0273 1005.5548 1007.7324 1008.7507 1013.6441 1041.6178 1046.1309 1077.8093 1078.3413 1125.8874 1159.5648 1172.9249 1174.1218 1177.7085 1182.2132 1211.4897 1291.2866 1302.9330 1313.5790 1354.4943 1377.3000 1384.7493 1393.8865 1437.2432 1443.7949 1447.2167 1451.1046 1453.9609 1463.3628 1574.9696 1575.9283 1599.2134 1603.4153 1606.7329 2961.9849 3018.9377 3049.5115 3124.7739 3133.5055 3138.8019 3145.9537 3149.9444 3157.9031 3159.1991 3168.1368 3169.3163 3176.0903 3176.7599
redmass: 5.9713 5.2073 3.9537 5.2344 5.9696 5.9742 5.7479 5.8368 5.2966 6.0360 8.0776 1.5448 2.4642 8.4152 5.1904 8.6442 5.1503 6.5789 6.9236 6.7719 8.2083 4.1664 3.0426 3.0118 8.4282 5.1250 4.1797 3.5085 3.1079 6.4848 5.0973 5.5149 6.8378 6.8076 1.8909 2.2936 1.4332 2.7675 3.4868 5.6935 1.2469 1.2455 13.4894 2.7939 1.3537 1.4379 2.5047 5.8894 1.3995 5.6393 1.3842 1.5262 1.3477 2.9322 1.4345 2.0742 1.7915 1.8235 1.5199 1.5181 3.3288 1.3023 1.0639 1.0562 1.1549 2.0623 2.9214 3.6212 1.3036 1.6529 2.0276 1.2827 8.2494 8.8208 2.2695 2.3705 1.0719 2.0137 1.0652 2.1962 5.8433 5.9502 6.1562 6.9426 7.6068 1.0408 1.0868 1.0935 1.0992 1.0857 1.0858 1.0890 1.0886 1.0929 1.0927 1.0968 1.0959 1.1008 1.1015
irintensity: 1.1220 0.8476 0.0874 2.1341 1.8206 1.9464 3.4112 2.5865 0.8968 1.4837 8.0329 2.0847 10.1086 4.3208 3.8162 6.9944 7.1188 0.5300 9.8877 46.1610 12.3011 3.1345 1.6089 1.6460 41.2955 9.2837 68.6870 21.8724 0.9454 0.0668 2.7517 3.4496 7.3135 11.4132 69.9639 8.5682 61.9960 30.1413 112.5132 0.9367 0.3196 0.2924 32.8732 7.1382 0.5546 3.8007 40.4322 11.7511 0.1198 5.4122 0.2837 6.7409 0.4363 0.2633 1.1397 8.0800 11.0423 27.8871 10.0572 6.7578 62.8323 36.0017 1.1841 0.0987 16.2283 58.2636 6.1057 108.8163 5.3412 16.7716 56.8724 124.0182 7.4456 7.4163 13.9700 12.4839 25.4150 15.5668 22.0056 2.0570 6.8244 3.5776 30.6591 0.5671 76.6231 2.6730 13.8812 3.6380 10.6044 0.7174 1.0671 9.4756 8.2484 15.0017 2.5024 3.5225 8.8099 37.3110 23.4989
temp: 298.150 k
press: 1.00000 atm
elementType: 16 8 8 8 7 7 6 6 6 6 6 6 6 6 6 6 6 6 6 6 6 1 1 1 1 1 1 1 1 1 1 1 1 1 1
symmnumber: 1
zpe: 672443.6 jmol-1
zpe.correction: 0.256120 hartree
zpe.thermalcorrener: 0.276788 hartree
zpe.thermalcorrenthalpy: 0.277732 hartree
zpe.thermalcorrgfe: 0.203204 hartree
zpe.sumelectzpe: -1311.510614 hartree
zpe.sumelectthermal: -1311.489946 hartree
zpe.sumelectthermalent: -1311.489002 hartree
zpe.sumelectthermalfe: -1311.563530 hartree
dipole: -1.9955 2.8514 -2.1062
dipole: 4.0680
quadrupole: -102.7443 -109.9025 -148.1118
quadrupole: 1.1573 -6.6432 -0.1380
quadrupole: 17.5085 10.3504 -27.8589 1.1573 -6.6432 -0.1380
hfenergy: -1311.7667338 hartree
pointgroup: C01 [X(C15H14N2O3S1)]
dipole: 1.0015606 -0.8047685 -0.9543036 debye
polarizability: 338.7658562|-69.3649418|208.8493418|55.779126|15.7965935|207.8478147 unknown
InChI: InChI=1S/C9H9N2O.C6H5O2S/c1-8(12)7-10-11-9-5-3-2-4-6-9;7-9(8)6-4-2-1-3-5-6/h2-7H,1H3;1-5H
charge 0 multiplicity 1
35 atoms
S  -1.667408 0.340323 1.313221
O  -0.972722 -0.665574 2.399317
O  -2.998934 1.226909 1.680741
O  -0.465141 2.217863 -1.560724
N  1.049797 0.92523 0.521345
N  1.75771 0.689604 1.616843
C  -0.027897 1.789062 0.791374
C  -2.042678 -0.658771 -0.243572
C  -0.642135 2.556322 -0.358738
C  -1.241416 -1.78029 -0.511479
C  -3.116522 -0.241159 -1.045144
C  -1.512339 3.727055 0.063101
C  -1.547199 -2.532023 -1.669154
C  -3.403134 -1.008356 -2.19759
C  -2.619566 -2.144628 -2.507553
C  2.819354 -0.24139 1.43655
C  3.159673 -0.859469 0.195367
C  3.563158 -0.536667 2.612624
C  4.235776 -1.761967 0.148966
C  4.63683 -1.447242 2.555282
C  4.975372 -2.060063 1.324771
H  -0.055849 2.274227 1.786391
H  -0.429703 -2.064673 0.165214
H  -3.713669 0.63335 -0.768041
H  -2.319876 3.365204 0.732194
H  -0.92285 4.46632 0.63797
H  -1.94794 4.213379 -0.822693
H  -0.949471 -3.416589 -1.912248
H  -4.233367 -0.716079 -2.848504
H  -2.846992 -2.732236 -3.403522
H  2.577136 -0.605779 -0.695946
H  3.269363 -0.04735 3.546747
H  4.509864 -2.236913 -0.799415
H  5.207362 -1.679741 3.460339
H  5.81241 -2.765587 1.277565
