program: Gaussian 09
title: 000243378
version: EM64L-G09RevD.01
frameworkgroup: C1[X(C13H12N2O3S)]
method: RPBEPBE
basis: SDD
operation: Freq
keyword: #p
keyword: freq=noraman
keyword: PBEPBE/SDD
title: #p freq=noraman PBEPBE/SDD
converged: YES YES NO NO
title: Mulliken charges:
elementType: S O O O N N C C C C C C C C C C C C C H H H H H H H H H H H H
charge: 0.855285 -0.555089 -0.537879 -0.265369 -0.276461 -0.351225 -0.100033 -0.249854 -0.222245 0.316677 0.179704 -0.204732 -0.220460 -0.215671 -0.366806 -0.349028 -0.215716 -0.241324 -0.216074 0.299935 0.296599 0.302427 0.360616 0.241636 0.242177 0.236572 0.265591 0.277695 0.237002 0.238744 0.237306
chargesum: 0.00000
title: Mulliken charges with hydrogens summed into heavy atoms:
elementType: S O O O N N C C C C C C C C C C C C C
charge: 0.855285 -0.555089 -0.537879 -0.265369 0.023473 0.009391 -0.100033 0.046745 0.080182 0.316677 0.179704 0.036904 0.021718 0.020901 -0.101215 -0.071333 0.021286 -0.002580 0.021232
polarizability: 3.20344322e+02 -1.32263001e+01 1.87989685e+02 -3.06284579e+00 1.44139111e+01 1.27947775e+02
1716.lowfreq: -15.0309 -5.3037 -0.0017 0.0012 0.0013 2.9342 23.0124 27.6908 36.5340
frequency: 22.9733 27.4980 36.4978 47.6399 66.5599 89.2894 113.0547 133.7779 144.4677 166.2683 193.4247 240.2716 261.1091 301.7169 312.7055 335.6850 375.4582 382.2328 401.9565 402.3819 411.3221 466.2603 495.2223 510.1489 601.2714 611.5384 649.7891 668.7077 677.2748 687.1686 693.6439 701.6174 756.3470 766.3293 788.0415 831.1207 846.8955 859.1575 893.6439 932.5829 940.4750 960.3530 972.8665 983.1196 983.3854 991.5577 1002.2718 1003.3926 1006.2780 1007.0748 1035.7182 1042.4349 1079.8214 1089.2542 1155.1101 1172.0198 1176.3515 1184.1910 1194.6529 1250.2710 1308.3676 1323.4390 1340.6072 1382.0816 1384.3896 1433.6802 1434.3654 1453.6422 1476.8352 1480.1743 1573.4124 1580.1981 1599.6935 1604.4855 1612.8134 3131.2816 3133.2766 3137.5994 3139.2815 3148.8800 3150.5366 3160.2160 3161.2936 3172.0857 3172.3798 3188.3084 3542.4233
redmass: 5.8220 4.2364 4.2870 7.7552 6.8863 8.6649 8.1610 6.2070 6.6041 6.6207 5.8884 8.6568 7.5574 6.3496 7.1117 5.6341 8.9761 5.3695 2.9162 2.8609 5.7690 5.4054 4.5061 4.8130 6.4742 6.4612 6.7277 4.0347 3.0766 2.4617 1.8991 1.6317 1.3931 11.1401 2.1898 3.9703 1.2565 1.2568 9.8911 1.3474 1.4350 1.2960 5.9679 1.7079 1.5123 2.7701 3.4590 1.3824 2.4656 1.9871 2.0808 2.0143 1.5765 1.6352 3.1358 1.0683 1.0605 1.1286 1.1200 4.0108 1.2899 1.3251 1.5966 8.4624 7.9463 2.1943 2.2351 1.9740 1.8771 1.5995 5.6965 5.4753 6.8064 5.7211 5.4334 1.0869 1.0874 1.0886 1.0888 1.0920 1.0916 1.0965 1.0962 1.1015 1.1015 1.0720 1.0792
irintensity: 1.2225 0.5608 1.4684 1.6090 1.4316 2.4521 7.2066 1.3846 7.6867 9.4263 7.8091 9.6701 11.5105 3.0718 8.3165 13.4291 24.8250 1.3442 0.6387 2.2221 32.5951 5.7219 56.0732 6.8495 0.1133 0.4830 0.7874 6.4894 0.8918 29.6603 35.1159 92.0958 76.7185 71.6946 20.4381 14.4378 1.5634 0.9230 55.2448 7.4340 3.7821 97.3714 16.2205 4.9385 1.4255 0.7286 64.6722 0.7386 3.2570 9.1287 9.0485 18.9177 8.7027 9.2578 222.8313 0.5656 0.5763 7.8073 18.5925 187.2700 10.5995 0.4324 341.1286 5.0126 2.4703 3.0784 25.8035 20.7623 7.9720 76.7992 6.5271 27.1225 1.3960 26.3797 95.7790 0.1160 5.0390 1.6108 5.4033 7.2219 3.7608 15.5846 4.7876 43.4622 26.6637 30.7107 55.3505
temp: 298.150 k
press: 1.00000 atm
elementType: 16 8 8 8 7 7 6 6 6 6 6 6 6 6 6 6 6 6 6 1 1 1 1 1 1 1 1 1 1 1 1
symmnumber: 1
zpe: 594301.2 jmol-1
zpe.correction: 0.226357 hartree
zpe.thermalcorrener: 0.244198 hartree
zpe.thermalcorrenthalpy: 0.245142 hartree
zpe.thermalcorrgfe: 0.177910 hartree
zpe.sumelectzpe: -1234.284470 hartree
zpe.sumelectthermal: -1234.266629 hartree
zpe.sumelectthermalent: -1234.265685 hartree
zpe.sumelectthermalfe: -1234.332917 hartree
dipole: -2.3227 3.4219 0.4600
dipole: 4.1612
quadrupole: -82.7856 -120.8193 -122.5790
quadrupole: 11.7510 2.6274 -0.5843
quadrupole: 25.9424 -12.0913 -13.8511 11.7510 2.6274 -0.5843
hfenergy: -1234.5108269 hartree
pointgroup: C01 [X(C13H12N2O3S1)]
dipole: -1.2425185 -0.924374 -0.5310117 debye
polarizability: 317.8473563|-22.6578287|173.670586|-3.9581627|30.9218459|144.7638399 unknown
InChI: InChI=1S/C7H7N2O.C6H5O2S/c8-9-7(10)6-4-2-1-3-5-6;7-9(8)6-4-2-1-3-5-6/h1-5,8-9H;1-5H
charge 0 multiplicity 1
31 atoms
S  1.726578 0.877979 0.433532
O  0.39978 0.515773 1.358726
O  2.908426 1.827431 1.049147
O  -1.128118 -0.367109 -1.598538
N  0.510685 1.865645 -1.276541
N  -0.733059 1.747309 -0.741143
C  2.546881 -0.768079 -0.048898
C  3.940686 -0.854633 0.10097
C  1.737417 -1.811573 -0.527073
C  -2.760594 0.534624 -0.005369
C  -1.51652 0.551028 -0.816289
C  4.558787 -2.079871 -0.241779
C  2.377756 -3.027251 -0.864866
C  3.779958 -3.159131 -0.7220
C  -3.901999 -0.133826 -0.52064
C  -2.805459 1.131337 1.284277
C  -5.094113 -0.167938 0.230492
C  -4.000733 1.087309 2.032162
C  -5.147579 0.448848 1.504042
H  0.604457 1.054676 -1.945033
H  4.50735 0.001332 0.482293
H  0.653364 -1.691333 -0.637284
H  -1.019785 2.508111 -0.120126
H  5.643058 -2.187282 -0.13239
H  1.779443 -3.864154 -1.239574
H  4.266347 -4.104196 -0.987086
H  -3.838446 -0.613601 -1.50291
H  -1.893088 1.549838 1.7251
H  -5.978426 -0.674048 -0.170899
H  -4.032051 1.530815 3.03282
H  -6.0741 0.418269 2.087876
