program: Gaussian 09
title: 000243393
version: EM64L-G09RevD.01
frameworkgroup: C1[X(C20H15N3OS)]
method: RPBEPBE
basis: SDD
operation: Freq
keyword: #p
keyword: freq=noraman
keyword: PBEPBE/SDD
title: #p freq=noraman PBEPBE/SDD
converged: YES YES NO NO
title: Mulliken charges:
elementType: S O N N N C C C C C C C C C C C C C C C C C C C C H H H H H H H H H H H H H H H
charge: 0.236728 -0.198559 -0.103618 -0.457870 -0.095217 -0.165901 0.414770 -0.329645 0.395742 -0.377416 -0.339609 -0.283226 -0.357646 0.179846 0.293079 -0.245701 -0.211747 -0.221408 -0.231602 -0.251214 -0.356157 -0.368886 -0.220954 -0.231990 -0.223230 0.333152 0.242428 0.320276 0.243153 0.254339 0.228876 0.229461 0.225502 0.225212 0.228951 0.276100 0.236646 0.236710 0.234151 0.236475
chargesum: 0.00000
title: Mulliken charges with hydrogens summed into heavy atoms:
elementType: S O N N N C C C C C C C C C C C C C C C C C C C C
charge: 0.236728 -0.198559 -0.103618 -0.124719 -0.095217 -0.165901 0.414770 -0.329645 0.395742 -0.134988 -0.019333 -0.040073 -0.103308 0.179846 0.293079 -0.016824 0.017714 0.004094 -0.006391 -0.022263 -0.080058 -0.132240 0.015755 0.002161 0.013245
polarizability: 3.67942746e+02 1.76294710e+01 3.08852284e+02 -1.10040588e+01 1.89410542e+01 1.39772951e+02
1716.lowfreq: -2.2139 -0.0018 -0.0014 -0.0007 4.8097 6.0803 22.1341 26.0936 34.8671
frequency: 22.0636 26.0413 34.8413 39.5341 43.9601 71.4703 89.9796 107.6440 135.6891 168.5167 184.8198 191.0193 230.2769 257.4750 289.5565 293.9329 354.5542 369.1520 377.7868 402.6614 410.7651 413.6841 432.6423 466.5190 485.9948 494.2398 510.7574 526.7803 541.4894 580.4709 587.0132 614.0165 615.9801 643.8681 653.7399 677.3849 691.1948 697.1862 706.0093 717.9893 729.9132 761.0868 761.9506 790.7101 803.2930 844.3670 858.3503 860.0204 860.0537 871.4720 921.2585 940.0543 940.3587 977.0421 979.7669 984.5146 986.5939 990.3440 1004.2561 1007.4206 1012.4167 1016.5772 1027.7284 1034.7882 1047.2531 1087.1869 1093.6095 1106.4146 1120.3226 1168.5911 1173.7472 1175.6979 1191.9539 1195.8869 1213.3143 1240.8145 1265.5944 1275.9518 1300.4951 1320.6413 1332.1456 1375.7878 1384.6676 1385.1587 1431.4753 1435.6031 1443.3676 1447.5666 1450.3571 1479.0864 1483.5529 1553.8196 1572.8290 1584.1551 1591.6159 1609.5027 1610.5183 1612.9265 1631.0211 3125.8644 3129.8476 3135.2258 3136.1282 3139.7948 3148.4161 3148.7488 3159.7473 3159.8506 3163.5306 3171.7514 3172.9391 3174.4555 3188.6907 3501.3700
redmass: 5.1909 5.4083 5.1742 5.2965 4.6479 7.3665 5.8449 6.7505 5.8124 5.1025 5.5684 5.7273 7.2632 6.0691 6.4834 5.3583 6.7607 4.9489 7.6867 2.8568 3.1278 5.8485 3.1613 4.8694 8.7158 1.4609 2.7873 6.3674 4.4105 7.6313 6.0090 6.3093 6.4253 6.8054 8.0407 7.2332 4.4833 2.1933 1.6281 6.2532 2.6186 1.5219 1.6086 2.6306 5.2843 1.2558 2.3917 1.6591 1.6684 5.7867 1.3954 1.4367 1.3864 1.3535 1.3166 5.7037 1.6691 3.4719 1.3024 1.3479 4.5537 2.5787 2.5156 2.6580 2.6767 1.6604 1.7308 2.7474 1.6362 1.1132 1.0490 1.0595 1.1213 1.1318 3.8093 2.9699 1.8381 4.3623 2.9395 1.3292 1.5195 4.6409 9.0029 8.9118 2.0062 2.8558 2.5835 2.4479 1.7219 2.2218 2.1913 7.8554 6.5820 6.1602 6.6166 6.2205 6.0389 7.8193 8.4166 1.0870 1.0851 1.0855 1.0876 1.0903 1.0919 1.0904 1.0955 1.0952 1.0955 1.1013 1.0975 1.0998 1.0951 1.0784
irintensity: 1.1085 0.0580 0.1862 1.3986 0.8042 2.6052 0.5598 0.9715 0.7920 2.3945 1.1149 0.5168 8.2511 2.0436 0.4416 6.2840 2.0432 0.9425 1.1533 0.6415 0.1530 7.8339 10.1878 6.0849 3.9588 82.7584 21.3241 13.2308 8.9018 25.3440 21.3006 0.8976 0.3094 19.9235 14.0681 0.6782 4.7936 28.1908 77.4922 19.9160 16.5636 127.8695 26.7337 24.9660 6.3555 1.4361 1.9239 5.5615 4.7215 7.0037 5.9786 2.4845 4.0190 0.5901 0.1154 0.7205 1.3982 0.0714 2.6386 0.4211 25.9898 40.3806 8.9470 9.9731 41.9198 11.4063 21.9800 15.6292 5.7368 0.1174 0.5872 1.5934 15.9309 1.3035 82.1431 125.7331 87.0510 144.2099 100.9913 0.1361 18.3234 2.2042 8.9400 1.3371 9.8415 24.4592 8.0143 70.9699 85.0616 127.1202 28.7212 549.2372 67.8228 22.7474 11.7946 103.1250 4.6450 79.6951 114.2034 8.2378 0.7111 1.9386 2.8808 17.2003 17.8014 9.3693 32.2416 13.8068 20.5862 22.1368 13.5186 20.7529 25.0008 17.4556
temp: 298.150 k
press: 1.00000 atm
elementType: 16 8 7 7 7 6 6 6 6 6 6 6 6 6 6 6 6 6 6 6 6 6 6 6 6 1 1 1 1 1 1 1 1 1 1 1 1 1 1 1
symmnumber: 1
zpe: 790564.3 jmol-1
zpe.correction: 0.301110 hartree
zpe.thermalcorrener: 0.321572 hartree
zpe.thermalcorrenthalpy: 0.322516 hartree
zpe.thermalcorrgfe: 0.249217 hartree
zpe.sumelectzpe: -1406.944189 hartree
zpe.sumelectthermal: -1406.923727 hartree
zpe.sumelectthermalent: -1406.922782 hartree
zpe.sumelectthermalfe: -1406.996082 hartree
dipole: 2.7392 -1.5289 -3.3318
dipole: 4.5762
quadrupole: -120.5133 -136.5998 -158.4018
quadrupole: -3.1535 -5.3893 3.5336
quadrupole: 17.9917 1.9052 -19.8969 -3.1535 -5.3893 3.5336
hfenergy: -1407.2452986 hartree
pointgroup: C01[X(C20H15N3O1S1)]
dipole: -1.2288709 0.6271466 -1.1567688 debye
polarizability: 367.3969305|14.2072465|308.612626|-18.9391742|-19.8667203|140.5584247 unknown
InChI: InChI=1S/C20H15N3OS/c24-19(15-9-3-1-4-10-15)22-23(16-11-5-2-6-12-16)20-21-17-13-7-8-14-18(17)25-20/h1-14,22H
charge 0 multiplicity 1
40 atoms
S  1.08248 1.779102 -0.549613
O  -1.296512 -0.001463 1.933269
N  0.075875 -0.827976 -0.372585
N  -1.104878 -0.073422 -0.395319
N  2.48956 -0.532985 -0.343375
C  1.255676 -0.08036 -0.392823
C  -0.035244 -2.266973 -0.297003
C  2.900137 1.829148 -0.529923
C  3.43875 0.50537 -0.413913
C  -1.330047 -2.848002 -0.242663
C  1.11094 -3.105395 -0.300977
C  3.731544 2.960949 -0.603118
C  4.840737 0.326081 -0.374534
C  -1.745657 0.319855 0.802726
C  -2.99604 1.129366 0.598928
C  5.132124 2.763241 -0.563084
C  5.678313 1.457987 -0.450058
C  -1.473477 -4.249751 -0.197326
C  0.945798 -4.505706 -0.254998
C  -0.338842 -5.091659 -0.205494
C  -3.961135 1.106311 1.63853
C  -3.229204 1.923165 -0.555831
C  -5.155407 1.844784 1.515322
C  -4.424723 2.665213 -0.674063
C  -5.392755 2.621389 0.355987
H  -1.569564 0.025047 -1.302261
H  -2.222778 -2.217608 -0.220003
H  2.104112 -2.655942 -0.32896
H  3.316271 3.970004 -0.686294
H  5.248464 -0.684864 -0.283279
H  5.79874 3.630396 -0.61823
H  6.765494 1.328625 -0.419145
H  -2.479635 -4.680842 -0.150156
H  1.838327 -5.141493 -0.255822
H  -0.454396 -6.179933 -0.168799
H  -3.748883 0.511534 2.532997
H  -2.467589 2.010017 -1.339994
H  -5.898148 1.819723 2.31975
H  -4.595096 3.286031 -1.560158
H  -6.319332 3.198132 0.261295
