program: Gaussian 09
title: 000243379
version: EM64L-G09RevD.01
frameworkgroup: C1[X(C16H16N2O3S)]
method: RPBEPBE
basis: SDD
operation: Freq
keyword: #p
keyword: freq=noraman
keyword: PBEPBE/SDD
title: #p freq=noraman PBEPBE/SDD
converged: YES YES NO NO
title: Mulliken charges:
elementType: S O O O N N C C C C C C C C C C C C C C C C H H H H H H H H H H H H H H H H
charge: 0.826393 -0.546553 -0.555415 -0.236730 -0.067337 -0.339393 -0.039776 -0.499844 -0.228349 -0.260071 0.207227 0.280029 -0.013489 -0.228093 -0.206573 -0.215472 -0.359266 -0.368555 -0.239708 -0.218347 -0.219689 -0.557973 0.267757 0.220653 0.322259 0.322448 0.293305 0.245379 0.241841 0.239334 0.234639 0.282060 0.263931 0.235426 0.234318 0.234575 0.227934 0.221124
chargesum: 0.00000
title: Mulliken charges with hydrogens summed into heavy atoms:
elementType: S O O O N N C C C C C C C C C C C C C C C C
charge: 0.826393 -0.546553 -0.555415 -0.236730 -0.067337 -0.017134 -0.039776 -0.011434 0.094099 0.033234 0.207227 0.280029 0.231890 0.013749 0.032761 0.019168 -0.077206 -0.104624 -0.004282 0.015971 0.014886 -0.108915
polarizability: 3.35980837e+02 9.98396177e+00 2.09851693e+02 -9.41068778e+00 2.15802165e+01 1.93962503e+02
1716.lowfreq: -7.5516 -0.0013 -0.0003 0.0015 2.1172 7.2016 19.9487 27.1831 38.8873
frequency: 19.9227 27.0985 38.8528 40.8755 44.9176 64.5571 67.1308 89.7832 95.2320 111.7018 131.8985 147.9926 164.9477 179.3767 216.1153 238.7729 247.6724 300.0549 314.0179 335.4597 363.8191 372.5416 400.2419 404.6226 406.5071 412.1023 451.6387 488.0726 504.9561 527.1245 602.1680 612.6601 627.1781 654.2220 672.7834 679.8173 688.5521 703.8593 708.4118 759.8866 779.1224 787.6408 838.6273 856.4746 859.3519 885.7596 914.9393 919.0133 940.9440 942.5157 958.8878 973.1795 976.5025 981.5931 989.7631 991.3985 1004.2143 1004.3794 1007.1327 1009.0902 1018.3036 1045.3008 1046.7113 1081.3919 1088.4414 1140.8613 1169.4721 1172.6399 1175.2554 1188.1645 1192.6539 1239.5403 1247.7495 1281.3612 1314.4867 1319.6252 1324.0299 1381.9681 1383.0617 1424.8312 1432.9639 1435.0110 1446.3194 1456.2349 1466.9849 1478.3192 1574.3500 1582.2413 1598.5902 1608.9738 1618.5572 1653.8979 2947.0834 3051.3827 3091.9589 3120.0765 3125.9761 3128.0731 3135.0004 3135.8265 3146.6092 3149.3243 3157.8842 3160.7534 3170.0861 3171.2957 3202.7983 3376.3538
redmass: 5.3506 4.3954 4.0354 3.9396 5.7725 4.0053 4.0365 6.9398 4.4268 5.1354 6.4159 4.9284 4.8737 6.8053 5.6474 7.4894 6.6734 5.2697 4.2390 6.1842 8.2259 4.5897 3.2268 2.9110 3.0618 4.0130 3.8005 4.7899 3.4575 4.1350 6.4788 6.3538 1.9316 7.1314 3.6723 3.0317 2.6194 1.6463 1.7542 1.3696 8.4686 2.3782 4.7665 1.2368 1.2516 12.7727 2.8745 1.6253 1.5022 1.3427 1.3515 5.1072 2.6227 1.7830 1.3897 2.8299 1.4877 1.3978 3.1030 1.3179 3.1777 2.0318 2.4501 1.5986 1.6327 2.0456 2.1480 1.2307 1.0662 1.1344 1.1169 2.5771 1.7367 1.2225 1.2801 1.2901 1.2905 8.5201 8.4538 1.2037 2.0270 2.2290 1.1920 1.9395 1.4011 2.2184 5.6477 5.8977 6.7571 6.0191 6.7085 4.5916 1.0664 1.0943 1.0608 1.0928 1.0946 1.0868 1.0882 1.0866 1.0920 1.0908 1.0963 1.0957 1.1015 1.1012 1.1143 1.0760
irintensity: 1.3113 0.7934 0.7051 0.1899 3.2255 0.7005 1.1724 2.7372 3.1031 3.8692 3.6192 5.8795 2.7774 7.2452 20.7222 6.9303 11.0864 0.8032 1.8160 21.0820 4.2189 6.3480 9.9608 0.0751 16.2355 6.8799 6.6452 64.6019 30.0720 12.9593 0.7248 0.8908 20.5828 2.4065 3.1689 12.7630 25.0088 21.9503 177.1715 95.5893 56.2854 20.7098 4.0173 0.2974 1.2589 47.1256 23.3505 4.1340 10.9053 4.2229 72.9563 22.4275 22.3232 3.0902 0.0632 0.2963 1.0994 0.2963 3.3859 6.3542 55.5771 19.6332 47.0851 6.6308 7.3881 22.1902 170.2865 26.6921 1.0016 10.1847 12.0631 218.5088 53.1279 2.3186 3.4233 1.7300 2.6715 4.3254 1.7504 17.7244 5.5923 24.8621 74.2277 25.3464 141.9976 14.7896 5.7181 18.4507 3.5853 7.7416 127.0890 6.9985 26.3344 3.8992 7.0119 29.0340 8.1275 0.2334 1.7133 2.5897 8.8149 4.9943 17.6552 4.8867 33.5340 43.4374 20.7217 9.5475
temp: 298.150 k
press: 1.00000 atm
elementType: 16 8 8 8 7 7 6 6 6 6 6 6 6 6 6 6 6 6 6 6 6 6 1 1 1 1 1 1 1 1 1 1 1 1 1 1 1 1
symmnumber: 1
zpe: 750039.7 jmol-1
zpe.correction: 0.285675 hartree
zpe.thermalcorrener: 0.307415 hartree
zpe.thermalcorrenthalpy: 0.308359 hartree
zpe.thermalcorrgfe: 0.231817 hartree
zpe.sumelectzpe: -1350.749662 hartree
zpe.sumelectthermal: -1350.727922 hartree
zpe.sumelectthermalent: -1350.726978 hartree
zpe.sumelectthermalfe: -1350.803520 hartree
dipole: 1.9442 1.1093 -1.8986
dipole: 2.9351
quadrupole: -104.4271 -127.3593 -141.3879
quadrupole: 7.0747 8.5421 0.7761
quadrupole: 19.9644 -2.9679 -16.9965 7.0747 8.5421 0.7761
hfenergy: -1351.0353371 hartree
pointgroup: C01 [X(C16H16N2O3S1)]
dipole: 0.8277287 -0.7176749 0.3650932 debye
polarizability: 336.1176024|-6.6076711|187.1591948|-8.7771374|19.0400747|216.5182359 unknown
InChI: InChI=1S/C10H11N2O.C6H5O2S/c1-2-8-11-12-10(13)9-6-4-3-5-7-9;7-9(8)6-4-2-1-3-5-6/h2-7,12H,1,8H2;1-5H
charge 0 multiplicity 1
38 atoms
S  -1.681735 -0.03165 -1.043809
O  -0.512715 1.126192 -1.174874
O  -2.575077 -0.423819 -2.370421
O  0.769804 -0.179914 1.802326
N  -0.371941 -1.701213 -0.255159
N  0.861265 -1.126398 -0.345017
C  -2.892644 0.433606 0.330756
C  -0.568028 -2.770989 -1.299076
C  -2.397399 0.623317 1.631245
C  -4.244804 0.561809 -0.030185
C  1.339984 -0.25743 0.681474
C  2.585248 0.483312 0.312016
C  0.084727 -4.055839 -0.829397
C  -3.332005 0.98748 2.629608
C  -5.157936 0.929518 0.984856
C  -4.70146 1.14337 2.307271
C  2.76315 1.039275 -0.983577
C  3.578663 0.673206 1.30735
C  3.945918 1.74908 -1.284089
C  4.760461 1.376703 0.99794
C  4.949379 1.909587 -0.300353
C  0.964286 -4.773236 -1.570791
H  -1.662046 -2.895182 -1.391936
H  -0.182831 -2.473321 -2.298873
H  1.40653 -1.173029 -1.22073
H  -1.336792 0.475051 1.868872
H  -4.560257 0.382891 -1.063379
H  -0.208589 -4.395222 0.172902
H  -2.985475 1.14126 3.656799
H  -6.218897 1.047711 0.740595
H  -5.415049 1.425671 3.089136
H  1.948261 0.987397 -1.715438
H  3.408325 0.267555 2.310179
H  4.074484 2.194762 -2.276277
H  5.530798 1.513959 1.764348
H  5.866016 2.460783 -0.537932
H  1.388523 -5.711902 -1.198425
H  1.273758 -4.454653 -2.574138
