program: Gaussian 09
title: 000243365
version: EM64L-G09RevD.01
frameworkgroup: C1[X(C10H9Cl3O2)]
method: RPBEPBE
basis: SDD
operation: Freq
keyword: #p
keyword: freq=noraman
keyword: PBEPBE/SDD
title: #p freq=noraman PBEPBE/SDD
converged: YES YES NO NO
title: Mulliken charges:
elementType: Cl Cl Cl O O C C C C C C C C C C H H H H H H H H H
charge: -0.004346 0.006120 0.011062 -0.303144 -0.180127 -0.344271 -0.476787 -0.681241 0.220033 0.568897 -0.294653 -0.331005 -0.057820 -0.194083 -0.093234 0.248192 0.248511 0.213083 0.228350 0.210632 0.210827 0.226352 0.283443 0.285211
chargesum: 0.00000
title: Mulliken charges with hydrogens summed into heavy atoms:
elementType: Cl Cl Cl O O C C C C C C C C C C
charge: -0.004346 0.006120 0.011062 -0.303144 -0.180127 0.097161 0.019916 -0.033430 0.220033 0.568897 -0.294653 -0.047562 -0.057820 0.091127 -0.093234
polarizability: 2.11890051e+02 1.37259537e+01 1.41377988e+02 -9.07473579e+00 4.09842603e+00 8.08853806e+01
1716.lowfreq: -13.7113 -8.0888 -5.2306 -0.0022 0.0020 0.0026 11.0900 27.4499 36.1721
frequency: -1.9161 27.1656 36.1525 45.3028 81.4993 92.9385 137.2233 162.4885 178.3713 192.9065 224.8046 236.3190 264.8798 271.9501 312.5174 343.5325 359.3517 418.8039 446.5623 493.5076 532.8089 552.9289 584.0115 650.2552 661.2573 691.0775 720.8626 737.2984 818.2504 856.4199 863.9664 876.4230 887.3346 918.4376 1027.0840 1042.9525 1061.8041 1100.5186 1104.4193 1122.3632 1204.8966 1218.3442 1226.3764 1277.2862 1293.9589 1329.6468 1357.5405 1361.9985 1394.9269 1437.1639 1438.9576 1473.1433 1479.9417 1484.9869 1563.1150 1580.0843 1694.3178 2975.7914 2982.7837 3001.8784 3038.5928 3056.1348 3079.5124 3080.6842 3181.4139 3183.5514
redmass: 2.0321 3.2056 8.3619 9.3011 8.8636 3.5472 5.7180 8.1232 28.2895 9.3074 6.8552 1.0797 6.8511 10.2293 21.1538 3.8695 8.7532 7.8010 3.2668 5.2462 3.9659 7.0412 9.4441 8.1144 4.9087 6.8747 3.0916 1.3241 5.8869 1.5089 1.3434 2.2398 1.9622 2.8744 5.4286 2.9542 3.3847 1.6145 1.7366 2.2510 5.1016 1.3354 1.2538 1.2122 1.2886 8.3610 1.6748 10.2165 1.2124 1.1802 2.5585 1.0540 1.0432 1.0756 10.4456 8.1326 10.9809 1.0363 1.0645 1.0611 1.0961 1.0987 1.1018 1.0989 1.0927 1.0935
irintensity: 0.1224 0.6044 0.1455 0.3645 0.3571 1.8826 0.5086 0.1094 0.2886 2.4597 0.1378 0.0721 9.3396 2.9379 0.7158 0.2841 0.9899 3.6552 16.1719 4.7285 2.0086 24.4838 2.5836 27.0495 1.0418 5.0848 8.7889 12.0801 72.4221 2.5433 3.3228 19.4986 30.5668 142.1506 257.4756 183.4648 102.5181 11.7216 73.6123 42.4944 33.3976 0.9146 4.7178 24.7161 37.4183 30.4708 36.5698 3.5829 7.7652 82.6086 160.0530 5.2043 13.7908 15.9699 0.5764 3.9325 148.9684 35.9871 5.5740 22.0278 0.9886 0.8356 64.6932 45.9821 2.2618 0.1553
temp: 298.150 k
press: 1.00000 atm
elementType: 17 17 17 8 8 6 6 6 6 6 6 6 6 6 6 1 1 1 1 1 1 1 1 1
symmnumber: 1
zpe: 433848.3 jmol-1
zpe.correction: 0.165244 hartree
zpe.thermalcorrener: 0.180321 hartree
zpe.thermalcorrenthalpy: 0.181265 hartree
zpe.thermalcorrgfe: 0.120326 hartree
zpe.sumelectzpe: -1915.978474 hartree
zpe.sumelectthermal: -1915.963397 hartree
zpe.sumelectthermalent: -1915.962453 hartree
zpe.sumelectthermalfe: -1916.023392 hartree
dipole: 2.5694 -0.2974 -1.5168
dipole: 2.9985
quadrupole: -100.8990 -103.8197 -113.9444
quadrupole: -5.3067 -3.1458 0.9376
quadrupole: 5.3221 2.4013 -7.7234 -5.3067 -3.1458 0.9376
hfenergy: -1916.1437181 hartree
pointgroup: C01 [X(C10H9Cl3O2)]
dipole: -1.0179568 0.0204118 -0.5958794 debye
dipolederiv: -0.3305433 -0.2902067 -0.0260667 -0.3173264 -0.5017569 -0.0060645 -0.005014 0.0002026 -0.0267512 -0.3033862 -0.298107 0.0141875 -0.3691659 -0.5193915 0.0314771 0.0084923 0.0273815 -0.0236721 -0.738453 0.0632865 -0.1135304 0.1097427 -0.0694843 0.0232732 -0.1432813 0.0200637 -0.042403 -2.1746779 0.0850576 0.3450967 -0.0089184 -0.2559102 0.0327445 0.433151 0.0017533 -0.5908879 -0.6739475 0.0264696 -0.154838 -0.0287831 -0.2400494 0.0195243 0.4295535 -0.0256978 -0.8729748 0.1088914 -0.0010004 -0.0214992 -0.0094049 0.1489744 0.0022082 -0.137909 0.0022702 0.0641743 -0.3584572 0.0077603 -0.0691455 -0.1039403 0.1139924 -0.0491089 -0.1360603 -0.0311617 -0.0701381 -0.0743048 0.006182 -0.021001 0.0200073 0.0952697 -0.0152192 0.0390593 -0.0179163 0.0655746 2.0892191 -0.0679821 -0.1405256 0.168196 0.1845366 -0.047679 -0.9993679 0.0498998 1.3288222 1.1858055 -0.2050806 -0.0435175 -0.1834934 0.059958 0.005821 0.3220697 -0.0272541 0.0391838 0.2722742 0.4774452 0.0653959 0.5098436 0.7141396 0.0104638 -0.0435873 -0.0217723 -0.0583041 -0.2922084 -0.0576609 0.048452 -0.1268304 -0.1749577 -0.0043881 -0.0003368 0.0138475 -0.0641912 0.2146905 0.5514064 -0.0493711 0.5418365 0.7743726 -0.0548156 -0.0367811 -0.0321635 -0.0414989 -0.3259489 -0.048162 -0.0437969 -0.0960063 -0.1542541 -0.0158115 -0.040929 0.0026344 -0.0291294 1.0147782 -0.2637946 0.2162236 -0.1914796 -0.065142 -0.0252969 0.2280132 -0.0457659 -0.0201046 0.0666147 -0.0074922 0.0132627 0.0183009 0.0348212 0.1093611 0.0585355 0.0745366 -0.009755 0.0576926 -0.0020592 -0.0187171 0.0242188 -0.0480549 -0.0749251 0.0283531 -0.0517566 0.0790333 0.0213368 -0.0521968 -0.0180284 -0.0271584 -0.1184793 -0.0958487 0.0125643 -0.0735955 0.0418541 0.0586277 0.0235161 -0.0266351 0.0175072 0.0031925 0.110311 0.0056802 0.0887406 -0.0566933 0.0751646 -0.0173084 0.001316 0.0166574 -0.012574 0.1339616 -0.0652205 0.126991 -0.0777119 0.0738548 -0.0060683 -0.0173995 -0.0655832 -0.1404108 -0.090694 -0.0517852 -0.0783347 0.0549462 -0.1283652 0.043455 0.0983146 0.0521836 0.0895205 -0.0386479 0.1402937 -0.0411615 -0.0118835 0.0850967 0.0220257 -0.0277299 0.0330656 0.0402078 0.0181563 -0.0256718 0.0171829 0.1595434 0.0762455 0.0105147 -0.0104473 0.0165308 0.0414796 0.021197 -0.0198216 0.0210758 0.162967 unknown
polarizability: 209.8167784|18.673793|142.9953584|8.0786911|-6.6168215|81.341283 unknown
InChI: InChI=1S/C10H9Cl3O2/c1-2-3-10(14)15-9-5-7(12)6(11)4-8(9)13/h4-5H,2-3H2,1H3
charge 0 multiplicity 1
24 atoms
Cl -0.124442 -2.691948 -0.140755
Cl 3.627891 2.523574 -0.234224
Cl 4.893148 -0.438431 0.454897
O  -0.983133 0.204108 -0.783848
O  -1.679577 0.036062 1.456567
C  -4.478561 0.473179 0.624359
C  -3.354063 0.129757 -0.375438
C  -5.871687 0.374695 -0.030479
C  -1.980489 0.114275 0.257261
C  0.378793 0.046987 -0.43118
C  0.929803 -1.222413 -0.143217
C  1.214905 1.179936 -0.454298
C  2.591148 1.045159 -0.1889
C  2.302309 -1.363361 0.129046
C  3.13428 -0.224697 0.105516
H  -3.342448 0.826594 -1.23359
H  -3.521063 -0.877985 -0.809143
H  -4.318085 1.494105 1.020051
H  -4.413336 -0.208449 1.49212
H  -5.9637 1.065928 -0.889346
H  -6.068853 -0.649448 -0.399601
H  -6.666628 0.629917 0.69274
H  0.782523 2.157725 -0.680834
H  2.72467 -2.34597 0.352899
