program: Gaussian 09
title: 000243367
version: EM64L-G09RevD.01
frameworkgroup: C1[X(C19H22O2)]
method: RPBEPBE
basis: SDD
operation: Freq
keyword: #pfreq=noraman
keyword: PBEPBE/SDD
title: #p freq=noraman PBEPBE/SDD
converged: YES YES NO NO
title: Mulliken charges:
elementType: O O C C C C C C C C C C C C C C C C C C C H H H H H H H H H H H H H H H H H H H H H H
charge: -0.286529 -0.223576 0.034862 0.451460 0.432670 -0.756185 -0.752354 -0.360629 -0.414896 -0.383685 -0.422367 -0.426536 -0.344585 0.346406 -0.243202 -0.241754 -0.247754 -0.487493 -0.339874 0.216320 -0.683677 0.211403 0.229731 0.235045 0.235782 0.210269 0.230739 0.253010 0.246672 0.246153 0.245496 0.253984 0.298726 0.224454 0.222525 0.227344 0.243359 0.242113 0.215676 0.219661 0.208841 0.208650 0.223747
chargesum: 0.00000
title: Mulliken charges with hydrogens summed into heavy atoms:
elementType: O O C C C C C C C C C C C C C C C C C C C
charge: -0.286529 -0.223576 0.034862 0.451460 0.432670 -0.080006 -0.075564 -0.107620 -0.168225 -0.137532 -0.176871 -0.172552 -0.045859 0.346406 -0.018748 -0.019229 -0.020410 -0.002021 0.095462 0.216320 -0.042439
polarizability: 2.97524738e+02 1.10685192e+01 1.84528025e+02 -1.79446400e+01 -6.63637842e+00 1.60517185e+02
1716.lowfreq: -19.8501 -0.0005 0.0007 0.0009 3.0428 3.5551 16.7805 26.9216 34.0753
frequency: 11.9934 26.9092 33.9930 35.8400 45.7446 57.9944 73.4341 93.8870 130.9512 163.7284 177.1469 202.0445 229.7285 249.4444 256.0084 285.7712 303.5475 313.2141 321.2441 329.6242 347.2893 367.1208 381.3340 403.6737 409.5325 440.9634 482.4054 535.2899 546.8734 567.6067 576.2158 615.3166 624.3995 661.1341 699.4884 707.4321 736.1262 738.6166 753.3465 773.9826 797.2893 840.1964 852.0580 855.4276 867.3857 874.3664 913.2613 927.9039 929.0237 935.3094 965.4927 978.8834 979.6371 990.3256 994.6232 1003.4321 1009.3524 1024.9734 1052.0630 1073.8790 1084.3299 1095.4837 1100.8863 1110.6036 1116.7541 1125.7560 1152.9914 1157.1852 1172.2892 1194.9590 1205.1379 1220.2120 1228.5703 1245.5851 1286.2601 1289.3176 1304.4700 1320.0684 1359.7590 1365.9041 1374.8740 1380.0277 1393.2452 1399.1317 1408.8365 1431.6478 1437.1566 1465.3103 1472.3245 1472.6004 1479.3734 1481.2002 1485.3946 1486.2934 1489.1406 1492.4076 1579.8358 1588.1736 1610.1527 1615.1018 1649.5204 2974.8391 2977.6747 2981.2236 2985.9190 3004.0728 3030.3622 3051.6622 3073.3456 3076.2718 3078.5391 3078.7793 3084.9081 3086.9637 3117.6432 3124.7769 3130.9639 3138.4017 3150.4039 3151.4781 3163.7322 3165.3672 3207.4923
redmass: 5.3210 4.5469 2.0033 3.0444 4.3033 4.0405 4.3697 3.1294 3.7096 4.4439 3.9392 4.5751 1.0839 3.0211 3.5017 1.2304 3.7228 2.1717 1.4745 2.3999 3.6551 4.0527 3.6230 2.8268 2.9570 3.7985 3.3608 2.8509 3.0605 3.6027 3.3262 6.4082 6.9876 5.2638 6.3698 1.6474 1.1976 3.5570 3.9926 2.0744 3.6058 1.3094 1.5344 1.2539 1.3250 3.1324 1.8446 2.3367 1.8633 1.4857 1.3542 1.3779 1.3680 4.8079 1.3654 1.7044 2.0512 2.4660 2.3835 1.8409 2.4610 2.2795 1.6615 1.8921 1.6395 2.5281 2.3030 2.5648 1.0547 1.1182 1.4023 1.3306 3.3514 3.3512 1.1398 1.4008 1.2780 1.3692 1.7309 5.9116 3.2860 1.4918 1.2142 1.2093 3.3239 2.1979 1.0861 1.0783 1.0979 1.1134 1.0421 1.5228 1.0952 1.4168 1.1134 1.6001 7.2967 6.0123 5.9970 6.3618 10.1255 1.0361 1.0351 1.0357 1.0615 1.0608 1.0976 1.1005 1.0998 1.0998 1.1015 1.0995 1.0997 1.0997 1.0850 1.0872 1.0890 1.0929 1.0898 1.0947 1.1004 1.0955 1.0942
irintensity: 0.2164 0.9267 0.6429 0.5154 0.1345 0.1126 0.4416 1.7333 0.6201 1.6965 0.5711 0.5292 0.0636 4.0228 2.6851 0.2970 3.8928 0.8613 0.2824 4.1545 1.1399 0.6376 0.2499 0.2331 0.2394 0.3370 1.5865 2.4683 17.4463 10.6758 12.4291 0.1247 0.9095 2.0863 6.1271 58.0897 14.8008 1.3235 0.4692 38.8904 2.8112 9.4766 51.0225 1.6633 0.0135 3.0962 4.3876 56.6146 17.8494 5.7076 1.4189 0.4317 0.6262 0.2834 0.8511 8.2324 32.5457 18.0232 58.4303 62.6064 186.5408 83.6429 20.3853 4.9098 5.0957 314.0575 117.9359 24.0863 0.3618 0.7745 56.6973 0.6749 12.0836 38.9198 11.1213 53.9371 4.1413 1.4429 20.9027 23.2786 5.9233 14.5434 7.6085 9.9489 14.0496 9.7249 23.9569 5.5814 16.7189 6.1963 13.0274 6.7442 19.0039 29.2881 6.3196 118.5163 8.5155 0.7958 8.0696 5.9053 185.5675 39.6213 24.9422 26.0066 7.7284 21.9613 1.8115 0.0477 12.7104 55.5756 70.5024 55.1914 38.5787 35.6119 5.8813 1.1260 11.5717 28.6146 11.1764 37.0089 20.2827 4.0552 2.2486
temp: 298.150 k
press: 1.00000 atm
elementType: 8 8 6 6 6 6 6 6 6 6 6 6 6 6 6 6 6 6 6 6 6 1 1 1 1 1 1 1 1 1 1 1 1 1 1 1 1 1 1 1 1 1 1
symmnumber: 1
zpe: 937503.7 jmol-1
zpe.correction: 0.357076 hartree
zpe.thermalcorrener: 0.377941 hartree
zpe.thermalcorrenthalpy: 0.378885 hartree
zpe.thermalcorrgfe: 0.304370 hartree
zpe.sumelectzpe: -886.137879 hartree
zpe.sumelectthermal: -886.117014 hartree
zpe.sumelectthermalent: -886.116070 hartree
zpe.sumelectthermalfe: -886.190585 hartree
dipole: -0.3602 -0.9338 1.0849
dipole: 1.4760
quadrupole: -113.1101 -121.9905 -123.6791
quadrupole: -6.4818 1.1774 1.5447
quadrupole: 6.4831 -2.3972 -4.0859 -6.4818 1.1774 1.5447
hfenergy: -886.4949554 hartree
pointgroup: C01 [X(C19H22O2)]
dipole: 0.1189125 -0.174732 -0.540891 debye
polarizability: 295.5602139|-3.028582|176.2521151|-26.0632171|13.3924643|170.7576193 unknown
InChI: InChI=1S/C19H22O2/c1-4-8-18(20)21-17-13-11-16(12-14-17)19(2,3)15-9-6-5-7-10-15/h5-7,9-14H,4,8H2,1-3H3
charge 0 multiplicity 1
43 atoms
O  -3.026452 -0.237114 -0.438442
O  -4.115497 0.546025 1.500536
C  2.570325 1.162511 0.291317
C  1.073345 0.775969 0.19246
C  3.455683 -0.054687 -0.081316
C  2.798253 2.374999 -0.660937
C  2.972507 1.60883 1.72899
C  0.597863 0.139023 -0.987252
C  0.127109 1.079736 1.19951
C  3.23326 -1.297917 0.572023
C  4.51801 0.023673 -1.015918
C  -0.762066 -0.174252 -1.152165
C  -1.248388 0.773394 1.060202
C  -1.682457 0.14622 -0.128063
C  4.044414 -2.420152 0.305249
C  5.333941 -1.100313 -1.288954
C  5.103526 -2.326717 -0.629043
C  -5.37929 -0.587421 -0.302192
C  -6.687354 -0.314352 0.466434
C  -4.15022 -0.018675 0.387808
C  -7.908176 -0.93673 -0.242599
H  3.831393 2.760367 -0.579709
H  2.602966 2.110646 -1.715495
H  2.10931 3.193178 -0.386536
H  4.056682 1.816366 1.759652
H  2.442803 2.532581 2.026369
H  2.758645 0.824407 2.476366
H  1.307676 -0.128343 -1.778271
H  0.449058 1.564661 2.126226
H  2.4041 -1.387762 1.284365
H  4.718327 0.961618 -1.54311
H  -1.128151 -0.667308 -2.057771
H  -1.957733 1.017892 1.851063
H  3.849802 -3.367558 0.820943
H  6.148226 -1.014799 -2.017928
H  5.734721 -3.197263 -0.840033
H  -5.424287 -0.170987 -1.327218
H  -5.221074 -1.676896 -0.432362
H  -6.825969 0.777679 0.575163
H  -6.597127 -0.714065 1.493458
H  -8.030871 -0.529862 -1.264192
H  -7.805142 -2.035081 -0.328409
H  -8.83869 -0.729221 0.315682
