program: Gaussian 09
title: 000243344
version: EM64L-G09RevD.01
frameworkgroup: C1[X(C7H10O5S)]
method: RPBEPBE
basis: SDD
operation: Freq
keyword: #p
keyword: freq=noraman
keyword: PBEPBE/SDD
title: #p freq=noraman PBEPBE/SDD
converged: YES YES NO NO
title: Mulliken charges:
elementType: S O O O O O C C C C C C C H H H H H H H H H H
charge: 0.199607 -0.426876 -0.210715 -0.226786 -0.408495 -0.233526 -0.540145 -0.488821 0.262417 0.284695 -0.734037 -0.775128 0.289117 0.370591 0.261752 0.258040 0.326770 0.285218 0.231857 0.253204 0.258031 0.383405 0.379827
chargesum: 0.00000
title: Mulliken charges with hydrogens summed into heavy atoms:
elementType: S O O O O O C C C C C C C
charge: 0.199607 -0.043471 -0.210715 -0.226786 -0.028668 -0.233526 -0.169554 0.030972 0.262417 0.284695 -0.122049 -0.032037 0.289117
polarizability: 1.42426630e+02 1.31773299e+00 9.14472316e+01 7.08989369e-01 -2.24731902e+00 9.40713261e+01
1716.lowfreq: -9.9086 -1.7976 -0.0018 -0.0018 0.0005 3.7893 28.0087 37.1035 42.6712
frequency: 28.0033 37.0808 42.6410 56.7981 82.1105 82.9752 115.4887 123.3269 147.1726 196.0595 226.1463 254.4817 260.4221 328.2925 393.3002 452.9451 479.7165 512.6541 537.9720 561.3646 582.4198 603.5548 657.4027 661.7318 732.6004 750.2827 773.1591 838.9006 845.2827 890.9929 909.2828 961.3929 1037.5462 1039.5169 1057.4145 1117.9015 1162.1420 1179.4704 1189.0026 1200.9034 1234.9965 1264.8159 1318.6615 1319.6169 1364.4959 1371.3401 1422.4168 1431.4792 1444.3868 1455.7740 1636.8107 1651.7113 1663.3659 2982.1632 2995.9446 3049.9771 3051.4372 3069.4057 3071.4796 3122.5678 3145.9302 3508.0735 3517.0174
redmass: 6.7312 5.6075 8.2221 5.7583 5.5074 7.3074 3.4917 1.1672 5.1225 8.8164 4.8991 7.7902 4.3133 3.9692 2.5791 2.2400 3.2121 3.6419 2.8127 4.3889 2.9278 2.0571 2.5650 1.5863 5.9778 6.3516 2.6180 2.9292 5.2932 1.9014 1.9514 1.9608 3.0331 1.8552 1.8907 2.3186 1.2894 1.3942 1.5009 1.3341 1.2458 1.4478 1.8911 2.1193 1.7087 1.2676 1.1057 1.1157 1.0676 1.0594 7.8483 8.5870 8.6036 1.0385 1.0598 1.0955 1.0618 1.0936 1.0891 1.1005 1.1062 1.0639 1.0640
irintensity: 1.4460 3.1883 2.2785 2.1663 3.0801 4.6556 7.7754 1.1242 0.2781 2.2977 0.5922 2.4891 3.1683 1.0832 10.8661 2.7332 43.0282 37.8038 22.4545 19.9105 45.4190 55.1801 78.5781 134.5520 10.2284 2.3133 2.9133 1.4845 18.2951 1.4499 4.8539 3.1354 190.4761 16.4973 344.1141 44.6078 14.2796 13.0743 56.8294 10.2142 8.0985 7.4077 51.1634 101.7468 47.8784 61.1034 24.8704 17.3366 22.9829 18.4857 89.7085 185.7582 236.0885 1.2488 12.5955 7.1204 6.9057 12.3317 2.3910 11.2088 2.7483 31.5584 31.5231
temp: 298.150 k
press: 1.00000 atm
elementType: 16 8 8 8 8 8 6 6 6 6 6 6 6 1 1 1 1 1 1 1 1 1 1
symmnumber: 1
zpe: 437855.5 jmol-1
zpe.correction: 0.166770 hartree
zpe.thermalcorrener: 0.181878 hartree
zpe.thermalcorrenthalpy: 0.182822 hartree
zpe.thermalcorrgfe: 0.121827 hartree
zpe.sumelectzpe: -1045.924860 hartree
zpe.sumelectthermal: -1045.909753 hartree
zpe.sumelectthermalent: -1045.908809 hartree
zpe.sumelectthermalfe: -1045.969803 hartree
dipole: -1.4945 -0.5574 1.7903
dipole: 2.3978
quadrupole: -74.5451 -74.7053 -90.3240
quadrupole: -4.4097 7.7047 -8.1562
quadrupole: 5.3130 5.1528 -10.4659 -4.4097 7.7047 -8.1562
hfenergy: -1046.0916305 hartree
pointgroup: C01 [X(C7H10O5S1)]
dipole: -0.6293229 0.4904168 -0.503364 debye
dipolederiv: -0.1268126 0.0563838 0.0478299 0.1020339 -0.1840107 -0.1248438 0.01835 -0.135674 -0.0198019 -0.6020409 -0.3305694 0.1743853 -0.3430101 -0.7926617 0.3059296 0.1145145 0.2969735 -0.4890989 -0.636695 -0.1197425 -0.0712003 -0.1471157 -0.5104903 0.2091484 -0.0980732 0.2046822 -0.6609999 -0.8252975 -0.0181407 0.2605243 0.247519 -0.6417644 -0.1115864 0.3805397 -0.0550901 -0.4748673 -1.2651692 0.2826835 0.0147791 0.479313 -0.4895231 0.0614904 0.0710282 0.0759846 -0.2823827 -0.7315922 0.1283072 -0.1000177 0.0747845 -0.3905272 -0.2216961 -0.173724 -0.0771951 -0.7804418 0.159171 0.0872607 0.1333113 0.0918037 -0.107118 0.0655593 0.1131764 0.0322611 0.0256237 -0.365294 -0.0411369 -0.1837129 0.1641012 0.0261754 0.139071 -0.3815245 0.0189915 -0.0956262 1.1343697 0.306176 0.1566129 0.2899727 0.4689566 -0.3270871 0.2441832 -0.30744 0.6970889 1.0741951 0.135675 -0.5494372 -0.1789175 1.3058738 -0.1453981 -0.5934761 -0.1045228 0.5299668 -0.0227946 0.0915515 -0.0068559 0.0967791 -0.0331647 -0.0976509 0.0815774 -0.0742754 -0.1406166 -0.4650973 -0.2513959 0.112298 -0.181861 -0.0620386 0.0484528 0.1138646 0.0889583 -0.0759711 1.5166904 -0.483332 0.1340499 -0.7222519 0.5180208 0.4198432 0.0356241 0.2570584 0.9485833 0.0983724 0.0000974 -0.0222414 -0.0227842 0.058365 0.0133284 -0.0162042 0.01438 0.0518121 0.0903541 0.0445889 -0.0201935 0.0029922 -0.0535464 -0.0317033 0.0083917 -0.0226345 0.0940548 0.055491 -0.0043337 0.0309924 -0.0224007 0.1151684 -0.0429339 0.06905 0.0213455 -0.0260634 0.1380066 -0.0046858 -0.0023661 -0.0277817 0.0569328 0.0278374 0.0514317 0.0411658 0.0448499 -0.0273522 -0.0379759 -0.0485115 -0.0069598 0.114534 -0.0158282 0.0079776 -0.0232089 0.0424971 0.0737424 0.0864318 -0.0300083 0.0200817 -0.0644189 0.0787494 -0.040564 0.0679204 0.0952718 0.0923261 0.0061282 0.0440942 0.0388803 0.0488558 -0.081036 0.0549292 -0.0745361 0.0232732 0.0030084 -0.0430817 -0.0783674 -0.0416629 0.094222 0.0141146 -0.1189216 -0.0249033 -0.0063783 0.2559713 0.1195736 0.0646703 0.0633882 0.2187264 -0.0522292 0.0952017 -0.0916336 0.3269367 0.3764471 -0.0104628 -0.0606356 0.023096 0.303433 -0.1315316 -0.037352 -0.1286078 0.1722898 unknown
polarizability: 141.9075269|-1.2071055|93.5764222|-5.2112467|-2.380389|92.4612382 unknown
InChI: InChI=1S/C7H10O5S/c1-4(8)2-5(7(11)12)13-3-6(9)10/h5,9,11H,2-3H2,1H3
charge 0 multiplicity 1
23 atoms
S  -1.052532 0.195535 -1.330944
O  0.085921 -2.517101 0.143834
O  2.734511 0.000224 1.413839
O  1.909945 -1.927214 -1.169388
O  -4.027369 0.888188 0.760759
O  -2.013785 0.577737 1.879335
C  0.463715 -0.162276 -0.209033
C  1.554338 0.860038 -0.541887
C  2.769264 0.730623 0.389605
C  0.930927 -1.582417 -0.474653
C  -2.419365 -0.578814 -0.262687
C  4.005175 1.522231 -0.004184
C  -2.754111 0.32464 0.901304
H  0.116744 -0.062841 0.83233
H  1.146307 1.88496 -0.438358
H  1.895584 0.753364 -1.589279
H  -2.034092 -1.547263 0.093607
H  -3.282296 -0.718899 -0.927794
H  3.744006 2.517367 -0.406677
H  4.538131 0.973897 -0.805834
H  4.684287 1.626297 0.856237
H  0.415889 -3.435508 -0.052586
H  -4.208692 1.492535 1.531855
