program: Gaussian 09
title: 000020812
version: EM64L-G09RevD.01
frameworkgroup: C1[X(C6H4ClNO2)]
method: RPBEPBE
basis: SDD
operation: Freq
keyword: #p
keyword: freq=noraman
keyword: PBEPBE/SDD
title: #p freq=noraman PBEPBE/SDD
converged: NO YES NO NO
title: Mulliken charges:
elementType: Cl O O N C C C C C C H H H H
charge: -0.019835 -0.380568 -0.239030 0.124364 -0.003042 -0.265989 -0.154490 -0.115065 -0.291727 0.153734 0.284671 0.254340 0.265317 0.387318
chargesum: 0.00000
title: Mulliken charges with hydrogens summed into heavy atoms:
elementType: Cl O O N C C C C C C
charge: -0.019835 0.006750 -0.239030 0.124364 -0.003042 0.018682 0.099851 0.150252 -0.291727 0.153734
polarizability: 1.26039502e+02 -4.18435858e+00 9.63631849e+01 2.32533250e-03 1.07817763e-02 3.29971414e+01
1716.lowfreq: -13.6026 -4.4953 -3.1419 -0.0010 0.0024 0.0033 47.1699 145.2055 148.6117
frequency: 47.1649 145.2033 148.6098 166.2821 294.5789 354.4381 382.8254 428.6547 494.0995 510.9229 595.2709 622.0309 659.8459 710.7962 751.0384 801.9872 822.0599 934.8381 945.6797 1005.4720 1032.8213 1074.7951 1123.3790 1167.2926 1181.0463 1334.6282 1345.9016 1381.6509 1430.8238 1551.7587 1568.3213 1626.1536 3159.5763 3183.8089 3192.7180 3517.2731
redmass: 11.3582 5.8412 10.1719 5.2125 8.4388 11.5262 8.3577 3.7661 3.6378 8.2797 5.2476 1.3451 6.8328 5.0964 2.1595 6.8218 1.9976 1.3730 6.6720 1.3575 3.3525 1.6378 3.0942 1.1353 1.9106 2.8177 6.5868 2.8045 3.0888 5.7930 6.8162 9.3143 1.0894 1.0938 1.0998 1.0641
irintensity: 3.6540 4.4584 2.1812 0.7051 1.3462 9.8818 11.0661 0.9299 4.5838 5.9762 65.4470 135.0264 19.1491 15.7727 55.9414 44.9713 30.9192 2.2786 11.1412 1.4264 269.6642 6.0252 81.2883 5.9388 43.8916 84.9997 13.0913 59.0940 64.3704 77.3584 19.7967 211.2163 4.6384 0.0149 3.1769 47.2995
temp: 298.150 k
press: 1.00000 atm
elementType: 17 8 8 7 6 6 6 6 6 6 1 1 1 1
symmnumber: 1
zpe: 237421.3 jmol-1
zpe.correction: 0.090429 hartree
zpe.thermalcorrener: 0.098938 hartree
zpe.thermalcorrenthalpy: 0.099882 hartree
zpe.thermalcorrgfe: 0.055719 hartree
zpe.sumelectzpe: -895.582970 hartree
zpe.sumelectthermal: -895.574461 hartree
zpe.sumelectthermalent: -895.573517 hartree
zpe.sumelectthermalfe: -895.617680 hartree
dipole: 0.1293 2.8434 0.0014
dipole: 2.8463
quadrupole: -65.5239 -55.9534 -64.6467
quadrupole: 10.9420 0.0024 -0.0071
quadrupole: -3.4826 6.0880 -2.6054 10.9420 0.0024 -0.0071
hfenergy: -895.6733991 hartree
pointgroup: C01 [X(C6H4Cl1N1O2)]
dipole: -0.2356776 1.0947396 -0.0005442 debye
dipolederiv: -0.6002061 -0.3723965 -0.0000462 -0.4870495 -0.4691717 -0.0000412 -0.0000785 -0.0000596 -0.0830912 -0.3718089 0.3006386 -0.0001479 0.3929813 -1.1696622 0.0001478 0.0002215 -0.0017301 -0.3935335 -1.0047922 -0.2350242 -0.0006689 -0.0392061 -0.7108312 -0.0007414 0.0012219 0.0010755 -0.322675 -0.7285061 -0.4168403 -0.0001914 0.156159 -0.3195772 0.0000726 -0.000925 0.0000738 -0.1285082 -0.0552086 0.2464501 0.0003288 -0.0423419 0.1347647 -0.0000016 -0.0002761 0.0000564 0.0599924 -0.1866421 0.0706146 0.0000706 0.100308 -0.1196864 0.0000454 -0.0006026 0.000274 -0.0810069 0.1744221 -0.0092699 0.0000405 -0.0688561 0.2001737 -0.0001853 0.0002495 -0.0002369 -0.1141886 -0.1257558 -0.1294478 0.0000509 -0.3815037 -0.2973095 0.0000034 0.0001175 -0.0000401 -0.0529059 1.0834475 0.7630164 0.0002628 0.837882 0.7673037 -0.0000439 0.0004128 0.0001344 0.0057054 1.5639008 -0.1688259 0.0001698 -0.3531645 1.5084135 0.0006538 -0.0006873 0.0003581 0.2168181 0.0766529 -0.0707098 -0.0000482 -0.0652158 0.078117 -0.0000054 -0.000028 0.0000216 0.1713583 0.0745148 0.0306132 -0.000033 0.0401219 -0.0580708 0.0001035 0.0000453 0.0001282 0.1547713 -0.0172446 0.0325683 -0.0000976 0.0255133 0.1007373 0.0000476 -0.0001859 0.0000556 0.1658017 0.1172264 -0.0413869 0.0003099 -0.1156278 0.3547989 -0.0000554 0.0005149 -0.0001107 0.4014621 unknown
polarizability: 123.8550187|8.8070596|98.5476678|0.004081|-0.0102469|32.9971414 unknown
InChI: InChI=1S/C6H4ClNO2/c7-5-3-1-2-4(8-5)6(9)10/h1-3,9H
charge 0 multiplicity 1
14 atoms
Cl -2.95091 -1.749669 0.00038
O  2.205068 -1.661717 -0.000081
O  2.970661 0.530584 -0.000571
N  -0.393746 -0.846056 0.001239
C  0.574482 0.120607 0.001395
C  0.271608 1.502863 0.000611
C  -1.087352 1.892733 -0.000215
C  -2.093413 0.902482 -0.000288
C  -1.665563 -0.447144 0.0005
C  2.018159 -0.287949 0.002585
H  1.090199 2.226831 0.000801
H  -1.362903 2.951607 -0.000791
H  -3.156077 1.154912 -0.000954
H  3.182587 -1.851984 -0.002011
