program: Gaussian 09
title: 000243345
version: EM64L-G09RevD.01
frameworkgroup: C1[X(C15H11ClN2O2S)]
method: RPBEPBE
basis: SDD
operation: Freq
keyword: #p
keyword: freq=noraman
keyword: PBEPBE/SDD
title: #p freq=noraman PBEPBE/SDD
converged: YES YES NO NO
title: Mulliken charges:
elementType: Cl S O O N N C C C C C C C C C C C C C C C H H H H H H H H H H H
charge: -0.038720 0.856400 -0.532915 -0.535584 -0.018723 -0.687975 -0.072251 0.364879 -0.095171 -0.032276 -0.204831 -0.343333 -0.211085 -0.199701 -0.277964 -0.362620 -0.242621 -0.404923 -0.393202 0.517430 -0.101467 0.294850 0.281173 0.264353 0.272057 0.292092 0.253904 0.261663 0.232002 0.231878 0.316408 0.316271
chargesum: 0.00000
title: Mulliken charges with hydrogens summed into heavy atoms:
elementType: Cl S O O N N C C C C C C C C C C C C C C C
charge: -0.038720 0.856400 -0.532915 -0.535584 -0.018723 -0.055296 -0.072251 0.364879 -0.095171 -0.032276 0.090019 -0.062160 0.053268 0.072357 0.014128 -0.108716 0.019042 -0.172921 -0.161324 0.517430 -0.101467
polarizability: 2.75042518e+02 -1.29922274e+01 2.39536808e+02 -1.38045218e+01 2.85712681e+01 1.65483645e+02
1716.lowfreq: -7.8967 -6.0407 -0.0017 -0.0013 0.0016 5.4228 14.8582 28.6008 39.0378
frequency: 14.5974 28.5429 39.0336 75.2204 107.5831 119.0826 131.7205 146.7506 197.7511 219.9248 224.0479 233.3436 249.2580 264.4167 300.9999 319.8327 368.6518 386.6043 402.4769 408.1758 411.8251 424.6947 435.0368 453.0664 457.7797 500.8285 518.7507 533.4917 576.3017 597.5193 609.1157 623.5519 634.6714 648.2483 719.2525 769.8730 776.1384 783.4580 809.0380 815.3144 833.5032 837.7251 850.3494 866.0108 898.6364 911.1181 925.6792 947.5967 959.8931 970.3783 973.4655 981.8268 1021.1338 1050.1201 1052.2523 1061.9992 1129.1819 1133.2291 1179.3465 1184.0857 1201.0535 1249.2057 1296.8579 1322.8801 1330.3655 1341.6715 1364.6908 1398.8776 1407.4217 1421.7252 1433.0303 1473.0544 1490.8355 1535.9859 1581.7350 1586.7814 1610.8748 1614.4728 1648.9784 3133.3553 3135.3418 3137.2705 3150.8349 3159.2328 3160.3803 3163.6559 3174.8612 3185.7889 3562.3025 3701.0119
redmass: 6.0702 5.5275 4.8920 6.6440 7.3829 9.0834 6.3330 5.4595 10.0237 11.1564 9.1827 6.8668 7.3065 6.0406 6.3976 6.7831 7.6504 8.4748 3.2686 1.0375 2.8750 2.5116 1.5730 5.4143 7.2406 3.4321 2.8869 6.4040 6.2994 7.9862 7.4748 6.9210 3.9207 7.6370 3.0010 7.7960 2.8367 9.3268 4.2127 1.3229 1.8232 1.7384 6.6403 1.2507 1.5245 8.8603 7.7112 1.3775 1.3617 1.4127 1.3513 4.7035 1.4332 2.3363 2.2437 2.1977 1.4632 1.5750 1.4480 1.2617 2.2216 1.4167 1.3038 2.6380 3.7941 2.5969 2.6031 5.2603 4.0524 2.5596 3.8857 3.4402 2.9671 9.0730 7.2007 7.3056 7.6708 4.7789 1.2276 1.0889 1.0888 1.0896 1.0903 1.0955 1.0951 1.0960 1.0965 1.0936 1.0453 1.1040
irintensity: 0.9874 0.8290 0.2763 1.2080 2.4886 3.6674 0.6989 0.4317 4.5077 5.0369 3.5144 0.6071 1.3723 1.9710 13.8142 3.1998 5.3975 10.6962 2.3957 2.4255 0.4057 19.2325 247.9353 11.1485 213.1188 1.7087 38.6893 14.2863 4.5093 26.4866 26.8850 0.7847 5.7483 9.5895 1.2689 29.2282 0.8671 51.6754 16.6354 3.3390 55.2973 77.0239 54.9131 14.3033 31.0057 70.4348 3.2388 1.0636 0.3006 0.5144 2.5039 3.6109 0.3906 49.5629 17.5071 26.1334 3.6427 15.4596 35.7373 19.9461 35.3330 3.6517 5.3943 79.5785 20.3823 10.9177 5.7589 5.6258 51.5416 21.3161 1.3142 76.1028 72.6219 47.1603 22.4524 9.5516 48.3957 169.1188 273.2482 9.8016 15.3245 19.8340 5.5149 11.0556 3.8760 8.5836 2.4922 0.9297 118.5017 25.7103
temp: 298.150 k
press: 1.00000 atm
elementType: 17 16 8 8 7 7 6 6 6 6 6 6 6 6 6 6 6 6 6 6 6 1 1 1 1 1 1 1 1 1 1 1
symmnumber: 1
zpe: 592618.3 jmol-1
zpe.correction: 0.225716 hartree
zpe.thermalcorrener: 0.244306 hartree
zpe.thermalcorrenthalpy: 0.245250 hartree
zpe.thermalcorrgfe: 0.177232 hartree
zpe.sumelectzpe: -1694.646651 hartree
zpe.sumelectthermal: -1694.628062 hartree
zpe.sumelectthermalent: -1694.627118 hartree
zpe.sumelectthermalfe: -1694.695136 hartree
dipole: 4.4919 5.3520 -4.4708
dipole: 8.2952
quadrupole: -123.5722 -126.0948 -142.1495
quadrupole: 22.6496 -20.1164 9.4222
quadrupole: 7.0333 4.5107 -11.5440 22.6496 -20.1164 9.4222
hfenergy: -1694.8723679 hartree
pointgroup: C01 [X(C15H11Cl1N2O2S1)]
dipole: 2.0806605 -1.6856697 1.8655373 debye
polarizability: 268.9622764|18.1958268|247.4870525|9.8064987|27.8207114|163.6136421 unknown
InChI: InChI=1S/C15H11ClN2O2S/c16-10-1-6-13-14(9-10)18-8-7-15(13)21(19,20)12-4-2-11(17)3-5-12/h1-9H,17H2
charge 0 multiplicity 1
32 atoms
Cl -4.750352 -3.21903 -0.081382
S  0.873764 1.422509 -1.290823
O  1.380055 2.973347 -1.133334
O  0.559061 0.751158 -2.752974
N  -2.923303 1.346306 1.569528
N  5.049156 -2.031328 1.435292
C  -0.71334 1.312697 -0.190298
C  -1.624578 0.215208 -0.250988
C  2.132726 0.338154 -0.42584
C  -2.733257 0.283129 0.696542
C  -0.903086 2.392232 0.657834
C  -1.541072 -0.904624 -1.142932
C  2.316894 -0.981933 -0.874403
C  2.913339 0.907054 0.597473
C  -3.687795 -0.782724 0.740277
C  -2.041021 2.360548 1.530146
C  -2.487133 -1.928568 -1.084338
C  3.294119 -1.774959 -0.249587
C  3.887582 0.11087 1.222415
C  4.087914 -1.244976 0.8145
C  -3.5449 -1.855983 -0.131029
H  -0.209712 3.239401 0.644366
H  -0.757404 -0.922708 -1.906162
H  1.730566 -1.36708 -1.714957
H  2.776976 1.956821 0.87763
H  -4.505853 -0.711746 1.460894
H  -2.224898 3.194557 2.216501
H  -2.431851 -2.778263 -1.770594
H  3.454798 -2.80539 -0.586499
H  4.505968 0.535706 2.021373
H  5.207099 -2.991887 1.143968
H  5.62634 -1.657796 2.183501
