program: Gaussian 09
title: 000243328
version: EM64L-G09RevD.01
frameworkgroup: C1[X(C13H16N2O3)]
method: RPBEPBE
basis: SDD
operation: Freq
keyword: #p
keyword: freq=noraman
keyword: PBEPBE/SDD
title: #p freq=noraman PBEPBE/SDD
converged: YES YES NO NO
title: Mulliken charges:
elementType: O O O N N C C C C C C C C C C C C C H H H H H H H H H H H H H H H H
charge: -0.212487 -0.229339 -0.429493 -0.452417 -0.395443 0.091916 -0.414442 -0.353949 0.441319 0.158281 -0.353839 0.151448 -0.387793 -0.337937 -0.697971 -0.387501 -0.368314 0.283020 0.225392 0.217249 0.223352 0.172815 0.326317 0.202266 0.200989 0.348864 0.249729 0.251736 0.209894 0.214462 0.220688 0.222107 0.253468 0.355616
chargesum: 0.00000
title: Mulliken charges with hydrogens summed into heavy atoms:
elementType: O O O N N C C C C C C C C C C C C C
charge: -0.212487 -0.229339 -0.073878 -0.126101 -0.046579 0.091916 0.028199 0.042218 0.441319 0.158281 0.049416 0.151448 -0.138065 -0.086200 -0.052927 -0.165395 -0.114846 0.283020
polarizability: 1.86982275e+02 1.78955029e+01 1.44025977e+02 1.76707077e+00 1.37256880e+01 1.50188097e+02
1716.lowfreq: -8.3309 -0.0003 0.0007 0.0008 4.5814 5.3324 26.6641 38.4789 49.8880
frequency: 26.0508 38.3291 49.8728 61.6101 77.1485 89.4140 123.6958 153.5621 161.5613 200.5761 213.5472 231.4016 248.3220 312.0262 320.0780 351.8132 359.1149 386.3387 404.1505 410.4086 418.5964 484.5473 511.7035 528.5389 601.2292 613.5183 620.7199 634.7626 650.7701 686.5265 709.8651 723.2653 732.7496 750.8287 786.3310 807.3758 809.9894 832.4084 878.8195 904.5907 936.0509 952.8493 958.4247 972.3441 997.0175 1005.4064 1042.7541 1072.9558 1086.8717 1103.0964 1115.0645 1144.0427 1148.6201 1182.7979 1194.9832 1199.9572 1239.0018 1252.6393 1262.0173 1289.5848 1299.5725 1307.2250 1311.8991 1316.3131 1333.2409 1350.4339 1360.7632 1388.6905 1391.7780 1421.9500 1457.4209 1465.5321 1475.3703 1477.8881 1486.2466 1502.2908 1594.2406 1625.8038 1679.4782 1720.4197 2956.6475 2970.7213 2974.0290 2987.7386 3008.9763 3031.2683 3055.4338 3070.9744 3075.3235 3116.0518 3151.5760 3154.6542 3175.0597 3581.2000 3586.4884 3605.3995
redmass: 3.7319 4.2068 7.8769 1.5225 5.3086 5.2686 2.8077 5.1140 7.9106 3.9090 2.1184 1.3863 5.6307 6.1982 4.0362 3.8620 1.2349 4.2609 3.9339 2.9548 3.8267 1.1815 2.9367 4.2675 7.1470 4.6148 4.5461 4.6727 1.4637 4.9435 2.7273 5.8565 1.2649 3.8827 1.3895 4.0405 1.4864 1.5979 2.1930 1.6920 1.3851 1.8302 1.3627 2.9894 4.8484 2.7109 2.6808 2.4148 2.4890 1.5769 2.3981 1.3672 2.3493 1.1370 3.4050 2.2689 1.7230 2.5957 1.3876 1.1966 1.1459 2.2408 1.5359 2.0212 1.6266 1.6897 1.6568 5.2081 1.2147 3.3133 1.0797 1.0740 1.0681 1.0420 1.0805 2.6392 6.5124 6.4385 8.6338 9.5223 1.0620 1.0599 1.0365 1.0625 1.0954 1.1001 1.1025 1.1010 1.0993 1.0894 1.0885 1.0936 1.0967 1.0660 1.0802 1.0797
irintensity: 1.1173 0.0835 0.0797 0.0419 0.2801 0.6866 0.0078 0.6523 2.5798 2.7660 2.2869 1.2175 2.0254 3.0167 1.7160 20.8240 120.4034 14.7673 7.7197 0.3714 4.6944 119.4655 23.9220 13.5731 7.9425 36.5464 4.7302 11.2655 139.1362 3.6793 1.0100 38.1370 24.4700 8.9898 5.4070 15.1490 23.2963 39.1175 5.0140 9.0812 1.5715 8.1263 1.5320 25.0293 5.5924 2.2700 4.9093 3.9043 19.2339 45.0123 8.7751 232.2590 9.0661 10.5859 40.5634 37.7154 20.8825 32.1318 13.7108 9.6535 16.6607 143.0066 19.1112 61.5515 39.5692 4.2090 9.9465 30.3490 11.8202 9.0468 5.5264 0.9046 5.2251 13.6883 16.5377 89.3390 20.1780 46.7479 486.8093 459.4833 11.0001 42.4802 33.1462 28.1858 3.4074 10.2605 26.8288 87.2206 50.8842 17.4467 5.6072 7.0485 3.4536 45.7751 73.5500 33.8026
temp: 298.150 k
press: 1.00000 atm
elementType: 8 8 8 7 7 6 6 6 6 6 6 6 6 6 6 6 6 6 1 1 1 1 1 1 1 1 1 1 1 1 1 1 1 1
symmnumber: 1
zpe: 714952.6 jmol-1
zpe.correction: 0.272311 hartree
zpe.thermalcorrener: 0.289849 hartree
zpe.thermalcorrenthalpy: 0.290793 hartree
zpe.thermalcorrgfe: 0.225592 hartree
zpe.sumelectzpe: -838.864411 hartree
zpe.sumelectthermal: -838.846873 hartree
zpe.sumelectthermalent: -838.845929 hartree
zpe.sumelectthermalfe: -838.911130 hartree
dipole: 1.1578 2.5659 -1.9989
dipole: 3.4525
quadrupole: -105.5616 -110.6206 -110.2416
quadrupole: -9.7181 -14.3297 -2.2757
quadrupole: 3.2463 -1.8127 -1.4336 -9.7181 -14.3297 -2.2757
hfenergy: -839.1367219 hartree
pointgroup: C01 [X(C13H16N2O3)]
dipole: 0.4724935 -0.9611653 0.8354441 debye
polarizability: 187.5074347|-17.2876168|144.9068493|-1.1764213|14.0039748|148.7820658 unknown
InChI: InChI=1S/C13H16N2O3/c1-2-3-8-13(11(17)14-12(18)15-13)9-4-6-10(16)7-5-9/h4-7,14-16H,2-3,8H2,1H3
charge 0 multiplicity 1
34 atoms
O  -0.828044 1.372262 -2.535132
O  -2.740452 2.881736 1.501688
O  4.897713 -0.248767 0.263899
N  -1.494196 0.927975 0.944494
N  -1.83583 2.440358 -0.671047
C  -0.835356 0.334123 -0.236486
C  -1.521427 -1.003028 -0.662095
C  -1.361333 -2.148296 0.360448
C  0.690184 0.191339 -0.06562
C  -1.138205 1.42219 -1.322921
C  -2.021564 -3.458708 -0.128795
C  -2.095353 2.156255 0.708956
C  1.349919 0.632773 1.104718
C  1.470367 -0.368039 -1.1137
C  -1.883736 -4.611288 0.888388
C  2.748604 0.498067 1.246855
C  2.864245 -0.50477 -0.986971
C  3.505119 -0.077132 0.199559
H  -1.101301 -1.307937 -1.638618
H  -2.597601 -0.799248 -0.830648
H  -0.286276 -2.328737 0.555698
H  -1.819994 -1.862661 1.330992
H  -1.607522 0.447983 1.834891
H  -1.562374 -3.756528 -1.093088
H  -3.094492 -3.273088 -0.338699
H  -2.164977 3.296699 -1.117488
H  0.775078 1.100246 1.910315
H  0.990662 -0.672858 -2.049008
H  -2.361387 -4.350596 1.851778
H  -0.819798 -4.836267 1.091237
H  -2.359567 -5.536549 0.515857
H  3.2413 0.845333 2.164429
H  3.47018 -0.928826 -1.792798
H  5.258215 0.092883 1.119612
