program: Gaussian 09
title: 000243331
version: EM64L-G09RevD.01
frameworkgroup: C1[X(C14H11N3O2)]
method: RPBEPBE
basis: SDD
operation: Freq
keyword: #p
keyword: freq=noraman
keyword: PBEPBE/SDD
title: #p freq=noraman PBEPBE/SDD
converged: YES YES NO NO
title: Mulliken charges:
elementType: O O N N N C C C C C C C C C C C C C C H H H H H H H H H H H
charge: -0.231591 -0.221335 -0.431549 -0.401560 -0.055719 -0.030046 0.451350 0.177084 0.138068 0.149892 -0.391016 -0.340476 -0.301767 -0.225529 -0.238099 -0.194067 -0.239172 -0.361216 -0.169286 0.359191 0.351376 0.260074 0.242403 0.288932 0.228909 0.227406 0.244023 0.230851 0.246409 0.236461
chargesum: 0.00000
title: Mulliken charges with hydrogens summed into heavy atoms:
elementType: O O N N N C C C C C C C C C C C C C C
charge: -0.231591 -0.221335 -0.072357 -0.050185 -0.055719 -0.030046 0.451350 0.177084 0.138068 0.149892 -0.130942 -0.098074 -0.012835 0.003381 -0.010692 0.049956 -0.008320 -0.114807 0.067174
polarizability: 1.75455782e+02 2.46617464e+00 1.70106689e+02 -5.20366074e+00 -1.86009395e+01 1.54808187e+02
1716.lowfreq: -11.1249 -9.3048 -0.0004 0.0006 0.0008 3.4646 20.3461 50.2498 56.6989
frequency: 20.2037 50.2326 56.6901 67.8658 112.1959 135.9987 170.2033 195.6400 244.6056 271.3853 281.3329 338.6964 350.1096 394.1600 400.2461 406.6484 476.8537 517.3038 585.7412 595.7312 611.9124 613.9262 617.7955 623.2327 657.9185 683.0096 697.3363 705.3940 730.7058 745.8539 761.8325 766.5879 788.9426 848.0919 908.2901 918.0258 922.8705 954.6171 965.0271 970.2086 975.9510 983.5607 990.4858 997.8636 1014.5494 1028.4913 1043.7267 1077.3790 1089.3037 1126.6421 1168.7188 1171.4034 1177.1095 1193.3607 1209.9715 1217.8374 1292.9184 1308.4889 1312.6466 1317.6671 1324.5862 1349.9277 1381.7860 1414.2198 1434.2538 1448.9290 1478.5191 1566.0204 1579.8348 1592.8285 1607.6028 1673.4958 1722.5702 3127.6514 3136.7193 3138.5177 3146.0883 3153.2617 3162.4169 3164.0834 3171.2839 3176.1180 3542.5020 3586.3772
redmass: 3.9020 5.0664 8.2940 4.8406 6.8134 5.9020 8.8548 5.0939 4.7694 8.2473 5.4745 7.5552 5.1741 8.6174 2.8567 3.5235 3.4102 3.4828 3.4737 2.4765 3.9407 6.4394 5.3103 2.8135 1.5096 5.2942 2.9851 2.5320 5.6323 4.2637 2.0851 1.9298 2.1309 1.2531 2.5009 1.5514 1.8094 4.3521 3.6667 1.8585 1.4225 2.9465 5.9914 1.3631 1.3302 2.2328 2.3235 1.8983 1.6368 2.9422 1.2478 1.2120 1.9149 1.1618 3.7341 4.9307 1.5649 2.7334 2.6531 1.7807 3.3821 1.7199 8.5295 1.9704 2.2252 2.1224 2.1509 6.0282 5.5803 6.2515 5.9705 8.8756 9.8336 1.0849 1.0880 1.0888 1.0904 1.0930 1.0951 1.0948 1.1000 1.1015 1.0788 1.0804
irintensity: 0.1995 0.1762 0.3438 1.8352 0.1291 3.5184 6.0027 1.0944 0.1769 3.0000 1.1268 1.1246 1.5465 18.0156 0.1207 2.4680 6.0904 16.9380 13.7831 31.4132 32.0798 1.1978 20.5935 19.9117 173.9998 12.4468 23.6155 58.6717 63.9233 15.6037 48.8254 49.3345 26.1423 0.4071 3.7373 0.4571 0.2747 6.3592 6.5308 4.3433 0.0193 21.5501 1.1433 1.7098 1.2703 9.6614 4.2572 8.3817 3.7218 11.6344 2.2076 0.3975 0.9822 7.6443 24.2383 92.4730 14.6863 147.9277 36.6213 13.9580 39.4802 24.1723 0.5020 23.6917 20.8777 59.8156 20.4012 9.8913 53.0495 0.2424 4.5024 411.2405 550.2056 0.0869 6.9266 10.0312 14.2460 24.5925 8.2462 10.3502 13.7327 24.4321 93.5224 76.9591
temp: 298.150 k
press: 1.00000 atm
elementType: 8 8 7 7 7 6 6 6 6 6 6 6 6 6 6 6 6 6 6 1 1 1 1 1 1 1 1 1 1 1
symmnumber: 1
zpe: 591799.2 jmol-1
zpe.correction: 0.225404 hartree
zpe.thermalcorrener: 0.240416 hartree
zpe.thermalcorrenthalpy: 0.241360 hartree
zpe.thermalcorrgfe: 0.181714 hartree
zpe.sumelectzpe: -853.511239 hartree
zpe.sumelectthermal: -853.496228 hartree
zpe.sumelectthermalent: -853.495284 hartree
zpe.sumelectthermalfe: -853.554930 hartree
dipole: -1.5527 -4.0812 0.2661
dipole: 4.3747
quadrupole: -93.7805 -115.3067 -110.0689
quadrupole: 5.2818 -2.5881 5.0475
quadrupole: 12.6049 -8.9213 -3.6836 5.2818 -2.5881 5.0475
hfenergy: -853.7366435 hartree
pointgroup: C01 [X(C14H11N3O2)]
dipole: -0.5049812 1.5874153 -0.4329207 debye
polarizability: 173.95426|0.4887149|163.7660798|6.3680033|-20.356594|162.6503172 unknown
InChI: InChI=1S/C14H11N3O2/c18-12-14(17-13(19)16-12,10-6-2-1-3-7-10)11-8-4-5-9-15-11/h1-9,16-17H
charge 0 multiplicity 1
30 atoms
O  0.346264 -1.2764 -2.336942
O  -0.461591 -3.754047 1.586519
N  -0.249797 -1.410557 1.195356
N  0.081554 -2.796566 -0.538461
N  -1.848183 0.757726 1.043414
C  -0.01771 -0.516494 0.050846
C  1.277873 0.32671 0.19617
C  0.157711 -1.537973 -1.124308
C  -1.239567 0.412787 -0.13092
C  -0.238413 -2.756787 0.863947
C  2.050562 0.256539 1.378808
C  1.694577 1.176358 -0.859387
C  -1.669891 0.895943 -1.387695
C  3.222195 1.036143 1.510795
C  2.868093 1.94897 -0.726867
C  -2.769724 1.782349 -1.424318
C  3.634395 1.886092 0.460379
C  -2.902994 1.617753 0.994027
C  -3.395899 2.159423 -0.215007
H  -0.745873 -1.047352 2.013018
H  0.183689 -3.676673 -1.044681
H  1.739683 -0.412378 2.186833
H  1.119247 1.22209 -1.789132
H  -1.168203 0.56847 -2.302825
H  3.811867 0.975212 2.432243
H  3.185141 2.597737 -1.550887
H  -3.131934 2.168882 -2.382698
H  4.543473 2.489054 0.56275
H  -3.362006 1.870831 1.956044
H  -4.247242 2.846658 -0.203921
