program: Gaussian 09
title: 000243305
version: EM64L-G09RevD.01
frameworkgroup: C1[X(C12H6Cl2N2O5)]
method: RPBEPBE
basis: SDD
operation: Freq
keyword: #p
keyword: freq=noraman
keyword: PBEPBE/SDD
title: #p freq=noraman PBEPBE/SDD
converged: YES YES NO NO
title: Mulliken charges:
elementType: Cl Cl O O O O O N N C C C C C C C C C C C C H H H H H H
charge: 0.012464 0.018797 -0.247539 -0.185623 -0.162332 -0.198115 -0.191753 0.010682 0.021759 0.222741 0.286635 -0.274032 -0.475143 0.431322 0.373014 -0.378453 -0.331987 -0.378151 -0.036862 -0.154075 -0.131400 0.286823 0.334302 0.297884 0.299090 0.280128 0.269823
chargesum: 0.00000
title: Mulliken charges with hydrogens summed into heavy atoms:
elementType: Cl Cl O O O O O N N C C C C C C C C C C C C
charge: 0.012464 0.018797 -0.247539 -0.185623 -0.162332 -0.198115 -0.191753 0.010682 0.021759 0.222741 0.286635 0.012791 -0.140841 0.431322 0.373014 -0.080569 -0.032897 -0.098023 -0.036862 0.115748 -0.131400
polarizability: 3.03676222e+02 -6.33255127e+00 1.86740556e+02 2.08784791e+01 -7.37866652e+00 1.17110462e+02
1716.lowfreq: -6.5838 -0.8072 -0.0024 -0.0020 -0.0014 3.2967 16.8082 24.1752 35.5407
frequency: 16.7353 24.1671 35.5373 43.3704 55.1454 93.7446 105.2332 137.3097 148.6832 168.2001 183.7353 200.0219 230.0805 289.1727 301.2628 311.4452 341.0452 358.0067 398.0376 420.0648 441.0691 447.2535 462.7661 491.2011 514.9365 552.5856 577.8939 628.2381 640.2024 651.3844 668.2918 682.8778 697.7308 711.8767 745.3428 755.9058 768.4355 821.4014 840.7554 860.9411 879.8362 896.7219 951.8982 953.5029 991.5644 1003.3910 1054.9299 1107.2316 1112.9739 1129.4876 1146.5048 1168.6871 1203.0805 1215.8302 1238.2866 1247.6491 1258.1088 1357.1397 1363.7767 1376.2705 1383.5879 1401.8345 1427.0375 1445.9931 1466.4400 1575.4684 1582.4349 1592.4851 1609.3342 3169.1066 3171.0877 3173.1990 3187.9132 3190.0392 3190.4215
redmass: 11.5030 10.0616 13.9054 15.0586 15.4498 8.0400 8.1019 14.0456 6.1527 8.9409 14.8689 10.0651 12.3799 8.7175 9.8629 8.2725 11.8568 9.7153 7.5642 6.0577 3.2688 5.9466 6.3733 6.0263 5.4878 5.4355 6.4942 8.1088 7.5155 7.8847 7.3712 6.8793 4.3770 6.6673 4.7796 12.5902 6.8413 1.3904 1.5071 6.8824 1.4642 7.0127 1.3435 1.4706 1.3427 5.3513 2.2755 1.8918 4.2946 1.3266 1.3416 4.4535 10.4246 8.5995 2.3906 1.5465 1.8146 5.8614 6.9168 11.9001 4.2911 9.4766 6.3760 2.6383 2.8516 7.8975 7.8756 8.5284 7.2518 1.0896 1.0897 1.0928 1.0928 1.0964 1.0977
irintensity: 0.2226 1.8041 0.4523 0.8178 0.1801 2.9946 0.1892 2.2319 1.6694 2.3774 0.2285 0.8075 2.2375 0.5064 1.2126 1.2155 1.1528 3.0368 2.5130 1.8596 10.7771 1.4673 13.3505 3.9600 2.8940 9.0850 4.7972 20.7223 6.8374 12.7218 3.5254 23.4055 13.5352 9.9295 2.6601 18.5805 18.6305 27.6650 31.9853 29.5050 16.3286 63.1452 0.0675 25.2642 0.8134 78.7233 46.5006 109.8406 14.9662 8.0004 35.3771 42.4653 318.8279 402.6251 192.8179 132.9793 40.3120 23.1710 74.8068 68.9478 14.8604 37.6395 25.0799 327.8831 108.2720 28.9945 73.9625 33.0034 147.4778 0.8836 0.9151 1.2012 16.9835 7.5150 0.0198
temp: 298.150 k
press: 1.00000 atm
elementType: 17 17 8 8 8 8 8 7 7 6 6 6 6 6 6 6 6 6 6 6 6 1 1 1 1 1 1
symmnumber: 1
zpe: 430926.8 jmol-1
zpe.correction: 0.164131 hartree
zpe.thermalcorrener: 0.182461 hartree
zpe.thermalcorrenthalpy: 0.183406 hartree
zpe.thermalcorrgfe: 0.113734 hartree
zpe.sumelectzpe: -1864.946402 hartree
zpe.sumelectthermal: -1864.928072 hartree
zpe.sumelectthermalent: -1864.927127 hartree
zpe.sumelectthermalfe: -1864.996799 hartree
dipole: -4.6759 -0.8577 -2.5640
dipole: 5.4013
quadrupole: -165.0711 -151.3342 -129.5247
quadrupole: -0.3114 1.9305 -6.9750
quadrupole: -16.4278 -2.6909 19.1186 -0.3114 1.9305 -6.9750
hfenergy: -1865.1105331 hartree
pointgroup: C01 [X(C12H6Cl2N2O5)]
dipole: 1.7793207 0.7980486 -0.8443134 debye
polarizability: 303.3878896|15.6448871|183.8035591|-15.8548096|16.8243808|120.3357912 unknown
InChI: InChI=1S/C12H6Cl2N2O5/c13-9-3-2-8(6-10(9)14)21-12-4-1-7(15(17)18)5-11(12)16(19)20/h1-6H
charge 0 multiplicity 1
27 atoms
Cl 3.875795 2.102616 2.239244
Cl 6.095429 1.586113 -0.132619
O  0.703243 -1.090506 -0.430434
O  -2.494485 -3.229055 0.86307
O  -0.747327 -3.360533 -0.602531
O  -4.467761 2.671957 -0.272975
O  -5.415497 0.633162 0.132413
N  -1.625069 -2.7005 0.066131
N  -4.401058 1.393139 -0.105697
C  -0.521841 -0.440627 -0.359888
C  -1.686834 -1.226572 -0.105112
C  -0.670733 0.959975 -0.543081
C  -2.954842 -0.628529 -0.001743
C  -3.065394 0.75913 -0.194302
C  1.931042 -0.366143 -0.361555
C  -1.935355 1.561209 -0.471866
C  2.230765 0.452455 0.747205
C  2.872953 -0.617856 -1.37723
C  3.50342 1.053472 0.817193
C  4.143636 -0.012773 -1.288799
C  4.459548 0.826695 -0.198937
H  0.211298 1.57045 -0.753376
H  -3.835645 -1.23528 0.224091
H  -2.065415 2.635406 -0.626179
H  1.506506 0.609129 1.551309
H  2.614923 -1.280697 -2.206625
H  4.894496 -0.189036 -2.063707
