program: Gaussian 09
title: 000243312
version: EM64L-G09RevD.01
frameworkgroup: C1[X(C15H14N2O5)]
method: RPBEPBE
basis: SDD
operation: Freq
keyword: #p
keyword: freq=noraman
keyword: PBEPBE/SDD
title: #p freq=noraman PBEPBE/SDD
converged: YES YES NO NO
title: Mulliken charges:
elementType: O O O O O N N C C C C C C C C C C C C C C C H H H H H H H H H H H H H H
charge: -0.246848 -0.192101 -0.164572 -0.204563 -0.197412 0.010127 0.020032 -0.241792 0.560460 -0.688236 -0.684951 -0.434329 -0.378747 0.323533 -0.365681 -0.379212 0.216396 0.288640 -0.271682 -0.477034 0.428772 -0.381584 0.214305 0.226769 0.219861 0.210653 0.210209 0.218411 0.230567 0.243900 0.241250 0.266981 0.263913 0.287476 0.332362 0.294129
chargesum: 0.00000
title: Mulliken charges with hydrogens summed into heavy atoms:
elementType: O O O O O N N C C C C C C C C C C C C C C C
charge: -0.246848 -0.192101 -0.164572 -0.204563 -0.197412 0.010127 0.020032 -0.027487 0.560460 -0.030953 -0.025765 -0.190429 -0.137496 0.323533 -0.098700 -0.115300 0.216396 0.288640 0.015794 -0.144672 0.428772 -0.087454
polarizability: 3.21077971e+02 6.80428527e+00 2.01622504e+02 1.65351644e+01 5.27946513e+00 1.28599474e+02
1716.lowfreq: -4.6721 -1.6880 -0.0007 -0.0006 -0.0004 6.5344 16.3285 25.1219 30.6837
frequency: 16.1387 24.9329 30.6499 41.7220 49.3771 57.8294 92.6231 100.4532 136.9633 152.0329 168.5166 190.7712 205.3870 223.8225 247.3251 279.0098 293.2127 316.9448 332.3963 349.9163 387.0513 410.8176 418.0305 423.8226 469.0888 493.3337 515.5917 530.1755 548.2426 596.4826 624.3645 635.4600 652.7078 662.4179 697.7737 711.1135 739.1339 747.0929 754.5969 761.8098 830.2468 836.7756 846.4224 851.6922 888.5857 890.1184 919.1815 953.6977 954.8854 957.0390 972.2251 991.2954 1006.2301 1050.5639 1054.7838 1105.0494 1112.3619 1113.4248 1144.4001 1147.7033 1154.9528 1186.6089 1203.0007 1217.6166 1220.2936 1244.0168 1257.1032 1287.9921 1306.9573 1322.7319 1358.5198 1374.0407 1379.5765 1385.3784 1398.1320 1400.2306 1411.3106 1430.8771 1464.9983 1467.0322 1467.3579 1479.6097 1480.9770 1493.6819 1583.7472 1593.9507 1603.1092 1614.8072 2976.6161 2978.9756 2984.3704 3069.7528 3077.0267 3080.2739 3084.2659 3133.9373 3135.1769 3157.8333 3170.9480 3172.2141 3188.4815 3190.1359
redmass: 3.4912 4.9558 5.3485 12.3034 3.8660 14.5619 6.2065 4.6970 9.4364 5.7156 5.9092 2.5941 1.2443 3.2288 1.1925 5.3025 5.1492 5.3519 6.5246 7.8948 5.0231 2.9143 4.9104 4.0997 3.7180 5.3632 5.2627 3.4310 3.2386 4.8330 6.1997 7.4173 7.1518 6.2060 5.0223 6.6118 3.9773 4.6658 9.1127 6.1360 1.8673 2.4238 1.5163 1.5959 7.7366 2.5594 1.1781 1.4655 1.4842 1.3386 1.3664 1.3369 3.0208 1.6238 2.1240 1.4439 2.5602 4.3106 1.7519 1.6907 1.7644 1.2987 10.0165 6.7850 2.1245 3.1714 1.7811 1.4884 1.3262 1.7898 6.6501 11.5404 1.1925 4.1084 1.5259 3.7234 2.5516 6.6464 2.7709 1.0446 1.0529 1.0556 1.3772 1.6271 8.9034 7.3072 6.7255 6.8444 1.0350 1.0359 1.0841 1.0999 1.0990 1.1007 1.1000 1.0889 1.0887 1.0965 1.0889 1.0959 1.0935 1.0957
irintensity: 0.0788 0.7581 0.1798 0.4887 0.1148 0.1060 2.7228 1.4267 2.6299 1.4433 1.8377 0.4360 0.0742 0.0236 0.2532 0.7068 0.9805 0.4646 0.3949 0.1685 2.6894 0.1767 0.2892 0.1578 1.4053 4.9512 3.8158 13.0370 14.1662 7.6948 3.7972 6.6697 9.7603 10.6936 17.8723 12.5363 3.5674 3.6008 14.6166 9.6352 15.1639 12.4624 42.5161 32.3800 42.0124 1.7830 3.1776 25.7445 0.2143 0.6651 0.2717 0.8264 43.1157 63.9954 21.5103 16.4459 1.5250 8.2807 4.4592 136.9037 0.9641 76.7905 339.0236 355.6596 11.3549 337.4088 11.8375 9.1140 0.5919 4.2670 91.3251 72.4660 15.4266 1.5720 24.1150 36.7909 5.5183 18.4978 212.4496 1.4102 7.2293 19.1533 9.9956 103.0921 31.8409 1.9441 157.8001 73.7235 28.5199 29.6668 17.9860 2.4794 94.6867 23.9608 44.6351 9.0833 21.9521 4.5117 0.6255 1.1676 12.0094 9.3827
temp: 298.150 k
press: 1.00000 atm
elementType: 8 8 8 8 8 7 7 6 6 6 6 6 6 6 6 6 6 6 6 6 6 6 1 1 1 1 1 1 1 1 1 1 1 1 1 1
symmnumber: 1
zpe: 699243.8 jmol-1
zpe.correction: 0.266328 hartree
zpe.thermalcorrener: 0.286599 hartree
zpe.thermalcorrenthalpy: 0.287543 hartree
zpe.thermalcorrgfe: 0.214003 hartree
zpe.sumelectzpe: -1063.852348 hartree
zpe.sumelectthermal: -1063.832077 hartree
zpe.sumelectthermalent: -1063.831133 hartree
zpe.sumelectthermalfe: -1063.904673 hartree
dipole: 8.5538 -2.7004 0.7871
dipole: 9.0044
quadrupole: -141.2596 -150.2781 -122.4017
quadrupole: -7.1937 -2.1452 3.4251
quadrupole: -3.2798 -12.2983 15.5781 -7.1937 -2.1452 3.4251
hfenergy: -1064.1186761 hartree
pointgroup: C01 [X(C15H14N2O5)]
dipole: -3.2928135 -1.3043806 -0.0773188 debye
polarizability: 322.7340869|1.7663521|200.8981972|5.6736193|-6.6580294|127.6676658 unknown
InChI: InChI=1S/C15H14N2O5/c1-10(2)11-3-6-13(7-4-11)22-15-8-5-12(16(18)19)9-14(15)17(20)21/h3-10H,1-2H3
charge 0 multiplicity 1
36 atoms
O  -0.130069 1.291547 -0.243862
O  3.345902 3.188026 0.65868
O  1.497043 3.413365 -0.662757
O  4.681575 -2.918017 -0.297072
O  5.837821 -0.96044 -0.073679
N  2.366419 2.704541 -0.033844
N  4.741371 -1.630925 -0.194152
C  -5.445706 -0.959654 0.212162
C  -4.026261 -0.400692 0.091438
C  -5.442062 -2.50312 0.377215
C  -6.226582 -0.282707 1.370749
C  -3.61631 0.289746 -1.077441
C  -3.088548 -0.54269 1.150122
C  -1.411918 0.647014 -0.137618
C  -2.312003 0.820325 -1.20252
C  -1.782555 -0.02081 1.048141
C  1.031404 0.542069 -0.253801
C  2.281567 1.226066 -0.129518
C  1.043511 -0.875143 -0.373568
C  3.494983 0.518315 -0.089204
C  3.467526 -0.881405 -0.216716
C  2.250543 -1.586218 -0.36653
H  -5.977762 -0.725252 -0.731638
H  -4.916936 -2.996377 -0.460388
H  -6.477482 -2.888643 0.411768
H  -4.941387 -2.80339 1.316614
H  -5.755514 -0.497063 2.348172
H  -7.264633 -0.660919 1.40794
H  -6.261215 0.814181 1.244947
H  -4.326945 0.420301 -1.901809
H  -3.380566 -1.056914 2.072745
H  -1.996672 1.368223 -2.095135
H  -1.072356 -0.112905 1.876558
H  0.094308 -1.40665 -0.478686
H  4.441098 1.050673 0.037876
H  2.272212 -2.673857 -0.472289
