program: Gaussian 09
title: 000243307
version: EM64L-G09RevD.01
frameworkgroup: C1[X(C13H6F3N3O7)]
method: RPBEPBE
basis: SDD
operation: Freq
keyword: #p
keyword: freq=noraman
keyword: PBEPBE/SDD
title: #p freq=noraman PBEPBE/SDD
converged: YES YES NO NO
title: Mulliken charges:
elementType: F F F O O O O O O O N N N C C C C C C C C C C C C C H H H H H H
charge: -0.165768 -0.135135 -0.139292 -0.240536 -0.181409 -0.161907 -0.178027 -0.159251 -0.189760 -0.184441 0.012781 0.011335 0.023827 0.196345 0.372348 -0.447425 0.297140 0.239638 -0.365524 -0.315815 0.276710 0.293732 -0.277132 -0.474780 0.434749 -0.374116 0.315263 0.290562 0.298058 0.288309 0.337011 0.302510
chargesum: 0.00000
title: Mulliken charges with hydrogens summed into heavy atoms:
elementType: F F F O O O O O O O N N N C C C C C C C C C C C C C
charge: -0.165768 -0.135135 -0.139292 -0.240536 -0.181409 -0.161907 -0.178027 -0.159251 -0.189760 -0.184441 0.012781 0.011335 0.023827 0.196345 0.372348 -0.132162 0.297140 0.239638 -0.074962 -0.017757 0.276710 0.293732 0.011177 -0.137769 0.434749 -0.071606
polarizability: 3.29168476e+02 2.51031249e+01 2.07848584e+02 -3.06112658e+01 7.78733548e+00 1.19428715e+02
1716.lowfreq: -4.2385 -0.0008 -0.0007 -0.0001 1.4689 6.9089 17.5774 21.1587 31.3932
frequency: 17.4840 21.1455 31.3737 39.0185 43.0681 54.7789 80.8572 90.7890 100.0793 135.0747 139.9267 154.2117 166.1203 185.5943 195.2915 238.5088 272.7201 295.2063 299.7612 309.1707 333.2804 338.4391 357.9950 402.7788 414.2716 431.3119 445.6621 470.3977 488.4108 492.1817 514.8165 555.3640 578.5611 596.2340 619.2607 626.7318 639.1723 653.6989 670.1746 678.2174 694.4145 712.1289 735.6270 743.3163 753.9813 759.9842 790.2135 845.5686 857.4687 867.3244 898.9325 914.2207 954.4333 979.4108 983.6652 992.7505 1022.6118 1044.3273 1055.0251 1090.3048 1111.7078 1143.0226 1145.8017 1165.6088 1201.2192 1206.0884 1214.3092 1234.9569 1246.1876 1253.9139 1279.7620 1363.5482 1375.4648 1379.3322 1397.9184 1405.1185 1410.3356 1423.1690 1464.8970 1475.2562 1585.0183 1596.4929 1602.3760 1611.6358 3167.4270 3178.5383 3181.1931 3186.8774 3189.7198 3194.1801
redmass: 13.0793 10.3422 12.7401 15.8857 14.9269 15.5416 12.9367 6.6278 9.1355 9.2783 12.1127 6.0658 14.2391 11.9405 12.1553 10.5560 10.3981 8.4327 9.0156 10.0181 9.5680 12.1105 9.9733 7.0037 6.2762 4.5418 6.9770 7.7359 6.1181 9.6738 5.5486 6.7386 6.2088 6.5731 7.7903 8.7152 8.9791 9.0384 7.4199 6.5293 8.2470 6.7122 5.1868 5.9893 10.5380 8.1724 8.2365 1.4971 1.5934 4.9999 7.1924 1.4266 1.4776 3.5288 1.6652 1.3437 8.0973 9.0553 2.3203 3.3361 4.1768 1.6151 1.3387 2.3577 10.2052 9.7539 8.6885 3.9030 2.7835 1.6224 1.6169 6.1433 8.9265 10.9591 11.6680 8.9228 4.9137 6.0725 2.8266 2.9398 8.2641 7.7419 8.1329 6.9693 1.0898 1.0898 1.0920 1.0926 1.0965 1.0979
irintensity: 0.5995 2.4071 1.6146 0.1073 1.1329 0.1910 1.3706 2.0856 2.4353 0.5351 2.4714 1.4437 2.9653 1.1328 7.4863 2.4624 1.1561 2.8558 0.3806 3.5498 3.1686 0.3723 3.9454 0.9570 2.8129 2.5133 3.1868 5.6966 13.0740 1.9598 4.7343 4.2794 1.7838 11.8557 12.3957 15.3064 6.3933 19.6403 12.0928 1.4079 20.7729 11.2570 4.4869 2.8130 3.2207 46.6514 12.0255 29.1999 36.3102 34.5277 111.0515 27.1757 24.9528 124.4957 32.7275 0.7589 138.6926 121.2705 42.0109 21.3017 11.3681 25.2101 29.3781 135.5060 267.0065 790.2221 99.6305 148.3535 291.3545 23.0776 149.5154 59.8521 84.6832 160.3019 30.2228 27.2320 54.8977 29.7811 239.2522 19.3574 177.0477 115.5922 55.9329 16.9516 1.4719 0.2879 4.1582 20.8047 8.6307 4.1748
temp: 298.150 k
press: 1.00000 atm
elementType: 9 9 9 8 8 8 8 8 8 8 7 7 7 6 6 6 6 6 6 6 6 6 6 6 6 6 1 1 1 1 1 1
symmnumber: 1
zpe: 492047.5 jmol-1
zpe.correction: 0.187411 hartree
zpe.thermalcorrener: 0.209701 hartree
zpe.thermalcorrenthalpy: 0.210645 hartree
zpe.thermalcorrgfe: 0.132135 hartree
zpe.sumelectzpe: -1487.199622 hartree
zpe.sumelectthermal: -1487.177333 hartree
zpe.sumelectthermalent: -1487.176389 hartree
zpe.sumelectthermalfe: -1487.254898 hartree
dipole: -0.1213 1.5517 -3.5231
dipole: 3.8516
quadrupole: -204.3712 -163.7151 -145.2856
quadrupole: 5.5041 2.4734 -7.1340
quadrupole: -33.2473 7.4088 25.8384 5.5041 2.4734 -7.1340
hfenergy: -1487.3870334 hartree
pointgroup: C01 [X(C13H6F3N3O7)]
dipole: 0.0297304 0.5499258 1.4116987 debye
polarizability: 330.8710302|-16.5923911|206.0212576|-33.5224774|-5.4906364|119.5534872 unknown
InChI: InChI=1S/C13H6F3N3O7/c14-13(15,16)9-6-8(2-3-10(9)18(22)23)26-12-4-1-7(17(20)21)5-11(12)19(24)25/h1-6H
charge 0 multiplicity 1
32 atoms
F  -1.962766 -1.939554 -1.964214
F  -3.143114 -2.861846 -0.284056
F  -4.161331 -1.472195 -1.781463
O  0.443527 1.587495 0.493798
O  -5.828531 0.873278 0.963884
O  -5.286418 -1.331334 0.709721
O  3.633527 2.70524 -1.792976
O  2.120466 3.536612 -0.296382
O  5.072735 -2.805054 0.941149
O  6.17362 -1.147078 -0.181273
N  -4.987741 -0.081311 0.750717
N  2.827098 2.583836 -0.791709
N  5.128532 -1.640981 0.388058
C  -2.629398 -0.467422 -0.165352
C  -0.874311 1.079995 0.545558
C  -1.280392 -0.0547 -0.189632
C  -3.556097 0.299136 0.59334
C  1.562871 0.753629 0.459215
C  -1.800468 1.858704 1.267704
C  -3.14798 1.462712 1.280806
C  2.751833 1.240898 -0.157584
C  -2.995756 -1.6720 -1.021785
C  1.576552 -0.529393 1.063634
C  3.916252 0.452536 -0.198571
C  3.89648 -0.812048 0.412309
C  2.740119 -1.313216 1.050292
H  -0.565878 -0.599935 -0.811025
H  -1.458919 2.753336 1.794028
H  -3.901546 2.038305 1.823947
H  0.677097 -0.900989 1.562134
H  4.815871 0.820039 -0.699408
H  2.771168 -2.297392 1.524637
