program: Gaussian 09
title: 000243267
version: EM64L-G09RevD.01
frameworkgroup: C1[X(C10H7NO3)]
method: RPBEPBE
basis: SDD
operation: Freq
keyword: #p
keyword: freq=noraman
keyword: PBEPBE/SDD
title: #p freq=noraman PBEPBE/SDD
converged: YES YES NO NO
title: Mulliken charges:
elementType: O O O N C C C C C C C C C C H H H H H H H
charge: -0.188647 -0.137783 -0.174676 -0.308931 0.178654 0.181506 0.112769 0.117214 -0.340650 -0.343226 0.251429 -0.206242 -0.206187 -0.744094 0.272970 0.274929 0.242929 0.243323 0.246233 0.255318 0.273161
chargesum: 0.00000
title: Mulliken charges with hydrogens summed into heavy atoms:
elementType: O O O N C C C C C C C C C C
charge: -0.188647 -0.137783 -0.174676 -0.308931 0.178654 0.181506 0.112769 0.117214 -0.067679 -0.068298 0.251429 0.036687 0.037136 0.030619
polarizability: 1.76464542e+02 1.81134648e+00 1.37823267e+02 -7.85426798e-01 4.67812516e-01 5.34012960e+01
1716.lowfreq: -3.5380 -0.0009 -0.0008 -0.0006 3.5875 5.0104 41.6097 59.3672 129.6951
frequency: 41.5422 59.3639 129.6951 135.9975 162.1702 176.8284 236.2651 265.6614 326.1836 344.2050 386.2411 412.9720 448.3324 523.2392 536.1167 565.0164 573.0663 657.1453 677.6857 694.9322 716.8845 788.1957 799.6606 833.2531 856.5512 909.5916 935.0290 980.2594 1010.2482 1011.6276 1030.4563 1056.1036 1082.2969 1130.0380 1174.5004 1175.1713 1217.8437 1255.7273 1282.5887 1387.8447 1416.3890 1433.2570 1449.5535 1454.5775 1458.8208 1612.1999 1617.5176 1622.7993 1659.7910 1700.9088 3007.6255 3095.9604 3136.3706 3142.5296 3155.8446 3167.4475 3176.8593
redmass: 4.6365 6.0070 4.9933 1.1619 7.1667 4.1873 7.2016 8.1393 4.5166 11.0221 5.3184 3.1878 4.7934 6.6558 6.8108 4.7019 3.6336 4.7949 6.4277 7.4216 2.8624 5.2813 1.6966 6.7122 6.8800 1.3961 3.0759 1.4089 1.3794 2.0886 2.0154 2.7000 2.6411 3.4135 2.0110 1.1631 4.2957 5.8016 1.5115 1.2170 6.8957 1.0771 1.0532 2.4768 2.6653 7.8943 8.0379 9.1130 11.9865 12.0239 1.0362 1.0962 1.1023 1.0867 1.0907 1.0958 1.1005
irintensity: 4.6258 3.6914 0.0058 0.1626 1.6798 2.7146 2.4260 1.7735 4.6752 7.2324 1.7046 2.8904 0.0905 6.6707 6.4912 25.5368 27.6267 0.6748 0.6762 5.0609 80.8162 0.8172 31.6845 7.1173 17.7591 0.0336 49.1615 2.1063 0.1935 3.7375 36.9073 57.6192 3.7516 12.5283 3.6397 1.6929 375.7154 620.1756 4.4594 62.8935 0.8686 39.4977 17.2751 12.0136 0.7107 65.4261 4.2050 66.2035 346.8334 184.9187 1.3043 5.2981 14.4895 1.7511 4.1472 3.8103 18.0407
temp: 298.150 k
press: 1.00000 atm
elementType: 8 8 8 7 6 6 6 6 6 6 6 6 6 6 1 1 1 1 1 1 1
symmnumber: 1
zpe: 390550.7 jmol-1
zpe.correction: 0.148753 hartree
zpe.thermalcorrener: 0.160414 hartree
zpe.thermalcorrenthalpy: 0.161359 hartree
zpe.thermalcorrgfe: 0.110326 hartree
zpe.sumelectzpe: -664.739359 hartree
zpe.sumelectthermal: -664.727697 hartree
zpe.sumelectthermalent: -664.726753 hartree
zpe.sumelectthermalfe: -664.777785 hartree
dipole: -5.0257 -2.5860 0.7789
dipole: 5.7055
quadrupole: -67.5937 -89.5992 -80.1841
quadrupole: -8.7610 2.8551 0.3329
quadrupole: 11.5320 -10.4735 -1.0585 -8.7610 2.8551 0.3329
hfenergy: -664.8881115 hartree
pointgroup: C01 [X(C10H7N1O3)]
dipole: 2.0095252 0.9603531 0.2796709 debye
dipolederiv: -0.6618471 0.2381058 0.0154681 0.1518241 -1.0058285 0.0121608 0.0052971 0.0240806 -0.3004937 -0.4900726 -0.150049 0.0260891 -0.0498402 -0.9378425 0.0368419 0.0255163 0.0591732 -0.2860355 -0.9275254 -0.1374257 -0.0284889 -0.4139757 -0.5917952 -0.1503113 -0.1053872 -0.1275816 -0.3419051 -2.1670547 -0.0405391 0.0023404 0.1243632 -1.148828 -0.0257281 0.0430337 -0.0183044 -0.1600376 -0.5464237 0.1936261 0.001883 0.2424915 -0.093359 -0.0072732 0.0086697 -0.0073597 -0.0175771 -0.4901739 -0.1729347 0.0185442 -0.2416735 -0.0994597 0.0082587 0.0191292 0.0160035 -0.0122426 1.4730917 -0.0298664 -0.0390337 0.180509 1.4647914 -0.0241866 0.0063946 -0.0300845 0.2483515 1.3671361 -0.0251538 -0.0206715 -0.3513351 1.4214708 -0.0755478 -0.0711408 -0.0723252 0.2574546 -0.0730462 -0.1009764 0.0047112 0.1125724 0.1364503 -0.0039169 -0.0119584 -0.0035281 -0.0927293 -0.1124297 0.0832504 0.0012588 -0.1151449 0.1438166 -0.0002254 0.0148314 -0.004922 -0.0911389 2.3381336 0.0246732 -0.0018002 0.1645539 0.783978 0.3079615 0.0240609 0.2479473 0.3116839 0.1152361 0.1236945 -0.0093425 0.1129783 -0.0470166 -0.0022683 -0.0092581 -0.0038502 -0.1335196 0.1305321 -0.1114118 -0.0050174 -0.0942526 -0.0388178 -0.0010818 -0.0044792 0.0005574 -0.1315854 -0.165707 0.1518689 0.0378475 0.2475208 -0.3265897 -0.1044436 0.059946 -0.0743688 -0.0112117 0.1058394 0.0265369 0.0011799 -0.0187953 -0.0183753 0.0036775 0.0035026 0.0014337 0.1589508 0.10357 -0.023759 0.0013633 0.0234928 -0.0145317 0.0027125 -0.0016111 0.003218 0.1594043 -0.0598922 -0.075471 0.006308 -0.080609 0.0509688 0.0040795 0.0081194 0.0039973 0.1585323 -0.0634264 0.0725182 0.0038996 0.076588 0.0565382 0.0002445 0.0013032 0.0005647 0.1582146 0.0702412 -0.0075446 -0.0894808 0.0011053 0.0926346 -0.0337926 -0.067322 -0.0459282 -0.0295333 -0.1081182 -0.0012486 0.0247335 -0.0714763 0.0995426 -0.0051369 0.0187224 -0.0262793 0.1171023 0.161937 -0.0378938 0.0482084 -0.000897 0.0722529 0.0579757 0.0326304 0.0575564 0.0383155 unknown
polarizability: 176.5054655|0.8272115|137.7440089|-1.9731893|1.090512|53.4396307 unknown
InChI: InChI=1S/C10H7NO3/c1-6(12)11-9(13)7-4-2-3-5-8(7)10(11)14/h2-5H,1H3
charge 0 multiplicity 1
21 atoms
O  -0.855017 2.332459 0.001054
O  -0.785889 -2.424577 0.16861
O  -3.294216 -1.141309 -0.307277
N  -1.256843 -0.047291 0.069543
C  0.976467 0.682387 0.010053
C  0.997407 -0.728903 0.036311
C  -0.438901 1.151228 0.032459
C  -0.404578 -1.242919 0.085313
C  2.161795 1.435017 -0.032183
C  2.205143 -1.445368 0.026881
C  -2.710306 -0.094404 0.044862
C  3.387202 0.72263 -0.045346
C  3.408392 -0.696966 -0.016557
C  -3.435366 1.163064 0.481515
H  2.130462 2.528719 -0.052208
H  2.206709 -2.539466 0.049342
H  4.333752 1.272395 -0.077695
H  4.371009 -1.218973 -0.028778
H  -3.059268 1.532319 1.451157
H  -4.506983 0.924354 0.552456
H  -3.278669 1.981804 -0.24151
