program: Gaussian 09
title: 000243265
version: EM64L-G09RevD.01
frameworkgroup: C1[X(C14H14O2)]
method: RPBEPBE
basis: SDD
operation: Freq
keyword: #pfreq=noraman
keyword: PBEPBE/SDD
title: #p freq=noraman PBEPBE/SDD
converged: YES YES NO NO
title: Mulliken charges:
elementType: O O C C C C C C C C C C C C C C H H H H H H H H H H H H H H
charge: -0.442547 -0.442492 0.174738 0.174895 0.146990 0.146653 -0.386088 -0.386042 -0.353211 -0.353764 -0.442478 -0.442154 -0.241459 -0.241501 -0.235582 -0.235511 0.250904 0.250921 0.274761 0.274832 0.223512 0.231321 0.223423 0.231469 0.230532 0.230543 0.230798 0.230794 0.337861 0.337883
chargesum: 0.00000
title: Mulliken charges with hydrogens summed into heavy atoms:
elementType: O O C C C C C C C C C C C C C C
charge: -0.104686 -0.104609 0.174738 0.174895 0.146990 0.146653 -0.135184 -0.135121 -0.078450 -0.078932 0.012355 0.012738 -0.010927 -0.010958 -0.004785 -0.004717
polarizability: 2.03133868e+02 1.92400323e-03 1.44972228e+02 1.64406809e+01 9.90911015e-04 1.14409029e+02
1716.lowfreq: -7.6394 -2.4605 -0.0007 -0.0006 0.0004 4.4842 38.7260 62.5625 75.1468
frequency: 38.6475 62.5576 75.1073 75.9899 91.9111 133.6766 161.9541 206.9950 228.5684 258.0931 318.3567 320.2877 340.9431 349.8158 410.5596 426.1037 456.7290 478.1160 552.3453 566.7210 581.8624 591.2366 616.5166 704.6198 738.1032 748.0565 759.0357 780.7967 788.3329 805.9669 878.4507 884.3725 944.1225 953.0297 960.3992 965.5431 981.0220 984.2222 992.7763 993.9095 995.7435 1040.9179 1051.2461 1089.8777 1116.0330 1161.3386 1162.8496 1172.7996 1173.4970 1199.6463 1200.8514 1252.1068 1268.7549 1279.9279 1312.3110 1312.5895 1355.7377 1359.6456 1377.7768 1378.7907 1430.3353 1430.9797 1463.4577 1470.6716 1474.8647 1489.1588 1573.7599 1581.4573 1607.2429 1607.2998 2976.2522 2976.8379 3045.6895 3048.8003 3123.6816 3124.6856 3133.9318 3135.0060 3148.0433 3148.4468 3163.1997 3163.6721 3556.1724 3556.4177
redmass: 5.3969 3.3392 3.4790 4.0687 3.8211 3.7426 2.6011 4.6431 3.9353 3.1711 5.0140 4.3106 1.2784 1.3052 3.3705 3.6285 2.7540 3.6622 4.4337 3.4947 4.6998 5.2778 6.8935 4.0514 3.1565 2.7415 1.4749 1.5505 3.4546 5.0164 1.2999 1.3166 1.7005 1.6026 2.3098 2.5652 2.0795 2.0376 1.6589 1.3454 3.3058 2.2574 2.0686 2.2424 1.7070 1.1200 1.1207 1.0608 1.0561 2.1146 2.2958 1.9582 1.5166 1.9134 1.3889 1.4449 1.5204 1.8938 1.9053 2.9306 2.2884 2.1282 1.8361 1.1343 1.2675 2.6330 6.5541 6.8893 6.2437 6.2905 1.0621 1.0630 1.1004 1.0989 1.0855 1.0852 1.0892 1.0894 1.0940 1.0941 1.1007 1.1007 1.0661 1.0660
irintensity: 0.0249 2.9589 0.1502 4.1092 0.0373 0.1008 2.2867 1.3138 3.5478 3.9241 7.8467 13.9551 242.6680 25.7749 1.3456 28.6400 37.8876 1.3451 1.8010 3.7527 4.5814 6.1581 4.4329 3.4784 16.7963 4.6126 91.4395 37.1553 12.2556 0.0804 2.4804 0.0923 93.7047 8.6343 89.0106 28.0731 9.1999 0.0628 1.3881 0.3335 4.9597 3.4686 3.5484 0.6157 2.7600 1.1705 29.1553 0.5691 0.6101 10.5524 14.3627 1.0601 2.5597 0.2657 20.9869 11.7477 27.4695 9.9945 1.1955 5.5788 7.7681 9.5930 30.3574 1.2366 0.8620 3.1167 0.0524 1.3783 0.8387 0.0671 62.3101 7.1503 12.7316 17.1216 2.5175 0.0490 17.6512 0.3991 9.7078 20.0227 49.8991 9.7817 13.7806 3.4965
temp: 298.150 k
press: 1.00000 atm
elementType: 8 8 6 6 6 6 6 6 6 6 6 6 6 6 6 6 1 1 1 1 1 1 1 1 1 1 1 1 1 1
symmnumber: 1
zpe: 633412.8 jmol-1
zpe.correction: 0.241254 hartree
zpe.thermalcorrener: 0.255853 hartree
zpe.thermalcorrenthalpy: 0.256797 hartree
zpe.thermalcorrgfe: 0.199092 hartree
zpe.sumelectzpe: -691.171042 hartree
zpe.sumelectthermal: -691.156444 hartree
zpe.sumelectthermalent: -691.155500 hartree
zpe.sumelectthermalfe: -691.213204 hartree
dipole: 0.0025 -3.4786 -0.0008
dipole: 3.4786
quadrupole: -87.4059 -100.0902 -92.8938
quadrupole: -0.0047 3.8338 -0.0072
quadrupole: 6.0574 -6.6269 0.5695 -0.0047 3.8338 -0.0072
hfenergy: -691.4122965 hartree
pointgroup: C01 [X(C14H14O2)]
dipole: 0.0274369 -0.0432637 1.36761 debye
polarizability: 206.0478345|1.0777735|111.5061089|-1.1531263|-1.0686374|144.9611819 unknown
InChI: InChI=1S/C14H14O2/c15-9-11-5-1-3-7-13(11)14-8-4-2-6-12(14)10-16/h1-8,15-16H,9-10H2
charge 0 multiplicity 1
30 atoms
O  -1.863552 2.529184 -1.978916
O  1.779085 -2.455333 -2.205558
C  -0.745209 -0.088222 0.48223
C  0.75471 -0.000901 0.456762
C  -1.577535 0.543447 -0.491737
C  1.549032 -0.568207 -0.58597
C  -1.360116 -0.802622 1.547352
C  1.410008 0.646643 1.54039
C  -2.987604 0.424772 -0.384611
C  2.962125 -0.452976 -0.525886
C  -1.000921 1.389613 -1.624566
C  0.929173 -1.344359 -1.745997
C  -2.762749 -0.917164 1.642637
C  2.815302 0.758335 1.588896
C  -3.582008 -0.304264 0.666649
C  3.596402 0.210201 0.545454
H  -0.719981 -1.282191 2.296953
H  0.799159 1.076892 2.342509
H  -3.607808 0.922662 -1.137878
H  3.552861 -0.901027 -1.332259
H  0.022833 1.731126 -1.371107
H  -0.944412 0.813794 -2.565789
H  -0.082869 -1.705533 -1.473525
H  0.833257 -0.711203 -2.646151
H  -3.211228 -1.480664 2.468307
H  3.295239 1.269812 2.430585
H  -4.67272 -0.389294 0.727688
H  4.688643 0.294088 0.569678
H  -1.993742 3.090523 -1.172448
H  1.944024 -3.065028 -1.441693
