program: Gaussian 09
title: 000243398
version: EM64L-G09RevD.01
frameworkgroup: C1[X(C14H22ClO3PS)]
method: RPBEPBE
basis: SDD
operation: Freq
keyword: #p
keyword: freq=noraman
keyword: PBEPBE/SDD
title: #p freq=noraman PBEPBE/SDD
converged: YES YES NO NO
title: Mulliken charges:
elementType: Cl S P O O O C C C C C C C C C C C C C C H H H H H H H H H H H H H H H H H H H H H H
charge: -0.058970 -0.270870 0.896075 -0.501991 -0.471710 -0.476446 -0.209373 -0.369856 -0.351290 0.530360 -0.691331 -0.357985 -0.443738 -0.214943 -0.209144 -0.106904 -0.213999 -0.214463 -0.653969 -0.654413 0.251347 0.214971 0.225608 0.195799 0.219396 0.218757 0.213052 0.213355 0.266077 0.244125 0.254938 0.256039 0.226146 0.231651 0.229842 0.229363 0.210526 0.236128 0.230622 0.211470 0.236056 0.229690
chargesum: 0.00000
title: Mulliken charges with hydrogens summed into heavy atoms:
elementType: Cl S P O O O C C C C C C C C C C C C C C
charge: -0.058970 -0.270870 0.896075 -0.501991 -0.471710 -0.476446 0.041975 0.070723 0.063905 0.530360 -0.046167 -0.091909 -0.199613 0.039994 0.046895 -0.106904 0.243799 0.244742 0.023308 0.022803
polarizability: 2.69998530e+02 2.06195254e+01 1.89446119e+02 1.56079074e+00 8.61291935e+00 1.93807343e+02
1716.lowfreq: -5.0125 -1.8192 -0.0020 -0.0020 -0.0013 3.5609 10.0979 21.8817 31.2390
frequency: 9.3460 21.8430 31.1840 35.0078 40.4928 43.9407 53.5174 62.2822 70.5287 74.5749 90.9969 106.4904 122.1434 129.0182 170.0773 182.2731 209.1347 224.8144 231.1160 237.3796 246.9530 259.0715 260.9062 284.8351 313.7187 318.1844 336.5567 373.4008 407.3624 411.1200 433.3444 448.4858 478.6184 528.0363 545.2330 623.6159 640.8155 696.1752 706.1360 711.4240 742.9890 755.4249 789.3723 812.4703 814.3653 832.3986 837.2741 872.2405 874.7728 894.7505 898.0762 910.9647 954.3515 969.9356 1000.8523 1015.2255 1016.4810 1024.7673 1065.4824 1071.5684 1097.1451 1104.7415 1105.7798 1106.1176 1125.1312 1134.0699 1135.6150 1183.2565 1211.2276 1221.4980 1256.1999 1256.9209 1270.8267 1284.8362 1294.9296 1320.9951 1335.3621 1353.4307 1356.0452 1357.5780 1382.9361 1391.1289 1394.8108 1395.3560 1399.9759 1458.2201 1458.3646 1460.0061 1475.3188 1476.8729 1477.3832 1478.4165 1478.9332 1487.0723 1487.7574 1488.5470 1588.7559 1601.5301 2971.7772 2975.4879 2981.0922 2986.9310 2988.1071 2988.5696 2996.1160 2996.5657 3020.9624 3050.9616 3054.4102 3056.6656 3073.6980 3076.1345 3092.7356 3093.1078 3110.4601 3110.4773 3133.1524 3151.5595 3169.9451 3173.8182
redmass: 4.6115 4.6535 3.8447 3.8047 4.0933 4.7226 2.4818 2.4739 2.1498 1.5940 4.7996 5.6264 7.7668 4.2156 4.1274 5.0908 2.6256 2.1010 1.5048 1.9056 1.7964 3.2442 2.0126 3.6677 5.2243 4.5932 6.0985 6.4505 3.2318 4.5901 6.0291 6.0617 4.7933 5.4928 3.1937 6.9634 4.1826 5.9602 6.9527 3.6003 1.3773 6.0884 2.2527 1.0928 1.0910 1.2856 1.5896 4.6519 4.7787 1.7551 1.8612 2.8978 1.3667 1.3673 4.2563 2.5821 2.6770 2.7365 2.4534 2.5444 1.5888 2.2192 2.0041 2.2098 1.7233 1.4235 1.4277 1.1153 1.8289 1.5824 1.1436 1.1397 1.2199 1.1717 1.2395 1.2126 1.8184 1.4292 1.2610 1.3381 5.6021 1.2145 1.2439 1.2449 2.2153 1.0428 1.0401 1.1010 1.0552 1.0604 1.0589 1.0545 2.2854 1.0862 1.0795 1.0800 7.4140 6.2207 1.0588 1.0380 1.0766 1.0670 1.0557 1.0553 1.0379 1.0380 1.0982 1.1031 1.1083 1.1073 1.1011 1.0995 1.0982 1.0982 1.1022 1.1023 1.0899 1.0887 1.0956 1.0972
irintensity: 0.2385 0.4632 1.3416 0.4355 0.8569 0.5437 0.0615 1.6871 3.7343 0.0967 2.7354 1.2995 3.4784 0.5806 0.1477 0.5780 5.1040 5.0418 1.2646 0.3974 2.7020 4.9683 5.7380 6.7276 4.9740 2.8655 7.8702 14.2978 0.3908 2.3806 2.5014 22.4614 6.6858 19.7728 50.7633 0.5925 31.7073 86.6699 111.6284 29.4554 3.9849 84.2353 28.3873 3.3561 1.8012 22.3995 108.3648 260.7780 320.1455 26.1603 28.2340 92.7362 0.9621 0.1713 33.6110 92.7307 82.0231 47.9379 0.3688 45.5046 13.4517 14.3831 7.2138 6.2036 2.1301 4.1540 4.6509 0.6873 6.7541 1.8429 0.6072 0.2392 1.9229 2.5142 4.7141 7.3115 11.1368 19.6991 5.9626 5.5510 4.1583 9.0723 28.0200 28.2082 6.9794 9.3055 13.6820 5.5567 2.9406 23.4461 3.7396 11.0900 47.2055 13.1809 9.8056 10.4342 1.2440 20.5639 20.4872 28.4909 2.0759 35.7256 19.8642 30.0025 28.2956 20.6130 3.4372 15.1263 11.7887 11.5581 70.4504 47.7222 28.0295 26.5366 32.5131 31.8602 7.4038 2.9707 5.5559 0.5011
temp: 298.150 k
press: 1.00000 atm
elementType: 17 16 15 8 8 8 6 6 6 6 6 6 6 6 6 6 6 6 6 6 1 1 1 1 1 1 1 1 1 1 1 1 1 1 1 1 1 1 1 1 1 1
symmnumber: 1
zpe: 882064.9 jmol-1
zpe.correction: 0.335961 hartree
zpe.thermalcorrener: 0.360740 hartree
zpe.thermalcorrenthalpy: 0.361685 hartree
zpe.thermalcorrgfe: 0.276037 hartree
zpe.sumelectzpe: -1970.148459 hartree
zpe.sumelectthermal: -1970.123679 hartree
zpe.sumelectthermalent: -1970.122735 hartree
zpe.sumelectthermalfe: -1970.208382 hartree
dipole: 2.0468 0.2028 -0.4083
dipole: 2.0970
quadrupole: -145.7334 -133.5322 -142.5563
quadrupole: -4.3443 -9.6505 -2.0860
quadrupole: -5.1261 7.0751 -1.9490 -4.3443 -9.6505 -2.0860
hfenergy: -1970.4844196 hartree
pointgroup: C01 [X(C14H22Cl1O3P1S1)]
dipole: -0.7963903 -0.1437824 -0.1604565 debye
polarizability: 266.0622001|26.9401814|193.6046926|-0.6852194|-8.7847369|193.5850993 unknown
InChI: InChI=1S/C14H22ClO3PS/c1-4-7-14(12-8-10-13(15)11-9-12)18-19(20,16-5-2)17-6-3/h8-11,14H,4-7H2,1-3H3
charge 0 multiplicity 1
42 atoms
Cl 5.9236 1.730867 -0.529685
S  -2.701538 -0.235326 2.229854
P  -2.29891 0.267418 0.258883
O  -0.642276 0.290093 -0.217582
O  -2.974837 -0.715662 -0.982896
O  -2.821547 1.818057 -0.287126
C  0.328745 -0.63282 0.471501
C  0.165834 -2.060811 -0.093645
C  1.055976 -3.095756 0.63202
C  1.696108 -0.021451 0.23257
C  0.83627 -4.526638 0.095847
C  2.077404 0.393651 -1.068499
C  2.618026 0.115847 1.297261
C  3.360054 0.931097 -1.307138
C  3.91087 0.644075 1.075774
C  4.259755 1.042133 -0.227986
C  -4.454328 -0.94578 -0.974287
C  -2.527604 3.00594 0.572408
C  -4.719358 -2.024332 -2.019581
C  -3.253005 4.183545 -0.070683
H  0.086619 -0.636405 1.554342
H  0.398394 -2.050038 -1.176026
H  -0.896706 -2.359323 0.005543
H  0.833164 -3.073194 1.718599
H  2.121691 -2.816797 0.521344
H  1.480859 -5.254115 0.62191
H  -0.214347 -4.845024 0.230985
H  1.069834 -4.586882 -0.983722
H  1.35839 0.317363 -1.890352
H  2.331798 -0.187308 2.311163
H  3.654461 1.259024 -2.308264
H  4.624136 0.748278 1.898335
H  -4.762518 -1.265073 0.040458
H  -4.953229 0.0077 -1.227229
H  -2.889579 2.802122 1.598643
H  -1.432403 3.1589 0.593346
H  -5.804601 -2.227751 -2.079234
H  -4.369833 -1.69703 -3.013239
H  -4.200336 -2.961204 -1.755552
H  -3.061378 5.102808 0.513122
H  -2.897391 4.344087 -1.102325
H  -4.341463 4.005814 -0.097258
