program: Gaussian 09
title: 000020593
version: EM64L-G09RevD.01
frameworkgroup: C1[X(C19H23NO2)]
method: RPBEPBE
basis: SDD
operation: Freq
keyword: #p
keyword: freq=noraman
keyword: PBEPBE/SDD
title: #p freq=noraman PBEPBE/SDD
converged: YES YES NO NO
title: Mulliken charges:
elementType: O O N C C C C C C C C C C C C C C C C C C C H H H H H H H H H H H H H H H H H H H H H H H
charge: -0.477773 -0.317890 -0.089231 -0.009277 -0.461421 0.320672 0.286899 -0.422099 0.211526 -0.369703 0.159381 -0.474336 -0.401333 -0.373670 -0.350758 -0.377600 -0.241606 -0.243291 -0.254440 -0.221262 -0.606383 -0.646443 0.193385 0.283567 0.237905 0.212428 0.201807 0.188982 0.245698 0.221945 0.258405 0.343673 0.290429 0.227098 0.249990 0.227925 0.225376 0.229156 0.226447 0.220737 0.184648 0.219877 0.212892 0.184529 0.273137
chargesum: 0.00000
title: Mulliken charges with hydrogens summed into heavy atoms:
elementType: O O N C C C C C C C C C C C C C C C C C C C
charge: -0.134100 -0.317890 -0.089231 -0.009277 0.015530 0.320672 0.286899 0.028234 0.211526 0.021086 0.159381 -0.006693 -0.142928 -0.083241 -0.123660 -0.127609 -0.013681 -0.017915 -0.025284 0.005184 0.018879 0.024115
polarizability: 1.97091501e+02 1.93819427e+01 2.26585143e+02 -6.28428414e+00 7.34280750e-01 2.06434488e+02
1716.lowfreq: -12.1887 -3.1997 -0.0005 -0.0004 0.0001 8.8123 15.8367 26.3381 39.8757
frequency: 15.7129 26.2908 39.8306 53.1374 78.8808 86.6777 102.1857 130.0632 140.3188 198.3209 221.2822 229.1636 233.7473 266.4931 274.8599 292.9257 298.6246 304.9444 315.7055 332.8602 336.7840 350.6530 377.7505 419.3075 439.8802 448.8573 465.9749 482.8159 525.2006 528.1902 537.1461 566.1946 607.0424 626.1284 640.9207 683.5945 721.9550 738.3345 743.1614 764.5712 769.8549 776.6578 797.8465 804.9260 867.1956 871.1176 882.6038 904.8368 917.6529 950.7626 956.8910 969.3162 975.5458 988.9599 989.9707 1001.0500 1027.9796 1036.6008 1044.1721 1053.9432 1059.3258 1067.5403 1086.7885 1094.2573 1099.9297 1109.7405 1138.4847 1144.1509 1151.7506 1168.5590 1174.0385 1178.0351 1193.6154 1205.8715 1223.4499 1241.1750 1244.6877 1260.0956 1269.4610 1270.0681 1285.8642 1315.9682 1335.9426 1346.9729 1364.5080 1369.4509 1376.0634 1390.0200 1418.9704 1428.5603 1432.4669 1442.8995 1451.4238 1457.8592 1460.2413 1467.0231 1472.0520 1474.2693 1474.9737 1480.6870 1484.3454 1496.1901 1582.4777 1589.0757 1607.4539 1610.2891 2818.5914 2840.4001 2857.3747 2950.4048 2957.8948 2992.2084 2995.7775 3014.2559 3030.1123 3036.8683 3051.6531 3073.8995 3088.7636 3102.7120 3106.1070 3129.7897 3131.7079 3147.5732 3152.9016 3164.3928 3168.7076 3184.5266 3563.8492
redmass: 3.4058 3.5192 4.3550 2.9951 3.5535 3.4125 3.5041 2.9922 3.7962 2.5748 1.9189 1.2612 3.4218 2.0323 4.2520 1.9416 2.5349 1.9008 4.0409 2.6370 2.3593 3.1373 3.3084 2.2058 3.4292 4.0934 3.4534 4.6423 3.6597 4.3261 4.1890 4.6339 4.1485 5.2307 5.0387 4.2406 3.2031 1.8417 2.4055 1.6966 2.0300 2.2646 2.2760 3.2586 2.3808 1.3426 1.6823 2.1270 3.0090 1.4147 1.4423 2.4876 6.5174 1.3235 1.3343 1.9852 2.5246 1.5427 2.3202 2.2601 2.3301 2.5062 1.5335 1.9838 1.8751 2.4053 1.4840 1.5388 1.5173 1.3428 1.4370 1.3333 2.2725 3.1345 1.7673 1.4338 1.3149 1.4467 1.9278 1.4357 1.4180 1.2381 1.7872 1.8326 1.4482 1.4082 7.5312 2.9063 1.1432 2.1542 2.1052 1.1588 1.2216 1.1054 1.0542 1.1070 1.9054 1.0822 1.1556 2.2887 1.0636 1.0619 6.8463 6.9061 6.7064 6.4630 1.0702 1.0575 1.0576 1.0726 1.0647 1.0822 1.0665 1.0713 1.0729 1.0974 1.0980 1.1009 1.0998 1.0882 1.0880 1.0857 1.0879 1.0916 1.0945 1.0976 1.0970 1.0948 1.0657
irintensity: 1.4709 0.0464 0.2412 0.7183 4.9409 0.6532 2.1692 4.7012 0.3139 2.8976 5.9049 0.8079 7.4409 6.3216 26.4460 26.1511 68.7849 14.8167 5.3599 17.0849 16.0284 1.3795 0.5510 1.6114 7.6682 7.0181 1.2144 8.3072 5.0228 6.8209 1.4106 2.0767 12.5949 4.0314 21.3698 2.8417 10.6286 12.4262 16.3786 33.2562 20.6932 75.4608 15.1193 3.8293 3.6091 0.8839 3.9892 3.5896 28.2185 2.8095 2.6066 43.3862 61.2833 0.0998 1.4425 7.3558 16.7922 18.0576 7.7147 11.2871 0.7327 11.3216 1.6569 16.5973 11.3158 13.8827 7.6229 13.9341 24.8322 5.3115 15.1523 6.6902 10.5827 60.0996 25.3256 23.8096 10.0393 0.8549 8.9226 10.6243 2.1057 8.7943 28.5200 4.8825 6.8078 5.4993 6.2103 4.2922 1.9609 12.5859 24.8709 4.7117 7.9696 6.3358 18.0921 7.0143 34.2304 11.3694 38.7384 13.7440 9.4008 16.5545 7.3891 3.3003 1.5818 3.2374 74.9178 85.9159 262.9475 35.4835 48.8029 23.1416 31.9986 44.4746 26.9691 14.4310 32.7891 36.0160 25.7792 7.8351 11.2211 3.6863 9.9494 22.9455 23.3132 17.7966 24.4318 7.6368 8.0705
temp: 298.150 k
press: 1.00000 atm
elementType: 8 8 7 6 6 6 6 6 6 6 6 6 6 6 6 6 6 6 6 6 6 6 1 1 1 1 1 1 1 1 1 1 1 1 1 1 1 1 1 1 1 1 1 1 1
symmnumber: 1
zpe: 985674.6 jmol-1
zpe.correction: 0.375424 hartree
zpe.thermalcorrener: 0.396124 hartree
zpe.thermalcorrenthalpy: 0.397068 hartree
zpe.thermalcorrgfe: 0.325081 hartree
zpe.sumelectzpe: -941.351805 hartree
zpe.sumelectthermal: -941.331104 hartree
zpe.sumelectthermalent: -941.330160 hartree
zpe.sumelectthermalfe: -941.402148 hartree
dipole: 0.3243 -1.2987 -0.2539
dipole: 1.3624
quadrupole: -127.0276 -125.1073 -121.0499
quadrupole: 2.8465 3.5261 -2.7542
quadrupole: -2.6327 -0.7123 3.3450 2.8465 3.5261 -2.7542
hfenergy: -941.7272284 hartree
pointgroup: C01 [X(C19H23N1O2)]
dipole: 0.0539488 -0.498485 0.1895254 debye
polarizability: 211.8823148|-25.1247721|210.5312143|-1.4879359|-2.2055382|207.6976021 unknown
InChI: InChI=1S/C19H23NO2/c1-20(2)13-7-12-19(21)16-9-4-3-8-15(16)14-22-18-11-6-5-10-17(18)19/h3-6,8-11,21H,7,12-14H2,1-2H3
charge 0 multiplicity 1
45 atoms
O  0.392747 -0.225359 -2.565348
O  -0.318155 0.761695 1.597513
N  -3.247723 -2.232763 0.746157
C  0.301046 -0.146527 -1.089665
C  -0.794639 -1.158579 -0.628452
C  1.670312 -0.506212 -0.448471
C  -0.027498 1.321858 -0.777983
C  -2.224142 -0.789222 -1.0709
C  1.930063 -0.355188 0.945487
C  -3.254836 -1.874583 -0.694017
C  -0.268957 1.728328 0.559377
C  0.954178 0.146193 2.01629
C  2.713195 -0.98051 -1.284281
C  -0.090785 2.303992 -1.792792
C  3.21288 -0.698247 1.447701
C  -0.589453 3.062628 0.880964
C  3.976624 -1.33827 -0.769814
C  -0.398213 3.648928 -1.482801
C  4.229343 -1.202237 0.612292
C  -0.653836 4.030912 -0.146184
C  -4.093998 -3.412921 1.013033
C  -3.587879 -1.098536 1.63202
H  -0.514213 -2.153413 -1.040698
H  -0.78402 -1.273404 0.465173
H  -2.510122 0.179949 -0.622556
H  -2.262774 -0.642914 -2.168376
H  -3.031787 -2.80053 -1.262027
H  -4.272466 -1.529987 -1.0224
H  0.626644 -0.696188 2.652905
H  1.491544 0.872467 2.661089
H  2.531657 -1.03232 -2.361361
H  0.290228 -1.176457 -2.82197
H  0.091129 1.992393 -2.823864
H  3.415076 -0.566209 2.519071
H  -0.791581 3.317951 1.926242
H  4.75916 -1.703234 -1.444236
H  -0.444842 4.393529 -2.285036
H  5.206718 -1.465642 1.031153
H  -0.901905 5.070099 0.096891
H  -3.754942 -4.263556 0.394174
H  -5.180292 -3.240945 0.795582
H  -4.003456 -3.704315 2.075057
H  -3.591429 -1.445791 2.680927
H  -4.593961 -0.657021 1.410864
H  -2.829743 -0.30184 1.54927
