program: Gaussian 09
title: 000243245
version: EM64L-G09RevD.01
frameworkgroup: C1[X(C10H8ClNO3)]
method: RPBEPBE
basis: SDD
operation: Freq
keyword: #p
keyword: freq=noraman
keyword: PBEPBE/SDD
title: #p freq=noraman PBEPBE/SDD
converged: NO YES NO YES
title: Mulliken charges:
elementType: Cl O O O N C C C C C C C C C C H H H H H H H H
charge: -0.050933 -0.256083 -0.415783 -0.245276 -0.471719 0.499534 -0.433839 -0.325602 -0.180426 -0.195188 -0.122072 0.238428 -0.298504 -0.210098 0.171760 0.229600 0.316335 0.312200 0.257952 0.257967 0.246176 0.291827 0.383745
chargesum: 0.00000
title: Mulliken charges with hydrogens summed into heavy atoms:
elementType: Cl O O O N C C C C C C C C C C
charge: -0.050933 -0.256083 -0.032039 -0.245276 -0.159519 0.499534 -0.204239 -0.009267 0.077526 0.062778 -0.122072 0.238428 -0.052328 0.081730 0.171760
polarizability: 3.18281636e+02 -9.39631439e+00 1.26628733e+02 1.59965730e-03 6.66169388e-04 5.15777371e+01
1716.lowfreq: -4.5668 -1.9384 -0.0025 -0.0019 -0.0019 7.5161 28.4062 46.0923 55.5653
frequency: 28.4034 45.8976 55.5617 72.7570 122.2028 140.0912 160.5729 210.9096 212.0940 249.3784 292.2256 343.5967 353.7904 400.3193 410.9252 494.1952 507.4547 574.3603 578.4989 621.7945 643.7290 646.9989 652.1542 705.6055 730.3505 742.6880 815.0216 828.7024 847.8727 910.0818 921.8330 939.7940 968.9923 983.7331 993.2808 996.0769 1058.8838 1073.9202 1116.2220 1149.5672 1184.8507 1219.6702 1257.3721 1290.8950 1311.4508 1328.5639 1364.7543 1402.1001 1477.4217 1500.5945 1586.9685 1600.1914 1605.6645 1629.7898 1661.0520 3109.7567 3121.6549 3166.3434 3170.6483 3173.6092 3198.4194 3520.1511 3522.3672
redmass: 10.0764 6.4157 8.7602 7.4607 6.0694 9.6884 3.6823 3.6127 9.6194 8.0311 10.8693 4.7562 5.3788 9.1147 3.0061 4.8308 2.6375 1.6194 6.0015 7.0062 1.2003 6.7236 1.9925 3.5013 8.5535 6.7448 1.3930 5.4927 1.4169 2.1757 5.5730 1.3609 4.2251 1.3191 4.1996 1.0882 2.2065 2.6688 1.3327 2.0544 1.1148 1.4538 2.2458 1.3168 1.5933 2.4942 4.7309 4.5689 2.4072 2.2808 9.6171 5.1635 4.2132 8.6804 6.1818 1.0921 1.0905 1.0914 1.0927 1.0953 1.0954 1.0641 1.0765
irintensity: 0.0529 0.9648 0.2844 5.9660 4.5394 4.2836 0.0009 0.2581 1.1507 2.3702 1.0819 0.0180 2.1611 47.0394 0.0050 18.8567 51.4249 61.8934 39.6754 3.8887 62.9732 21.1396 69.9124 3.1314 37.1577 23.1079 39.6960 0.8554 66.0596 2.3116 6.5227 1.1474 10.1068 4.8255 44.8599 63.1001 441.0384 62.9098 18.8541 9.4756 0.3086 38.2320 2.0604 5.8151 31.2778 189.0241 104.2344 15.6299 78.2888 278.7126 100.3844 30.1767 52.9075 240.4911 69.2553 2.6385 11.0136 2.0439 2.4610 2.6981 8.4308 67.5569 16.5954
temp: 298.150 k
press: 1.00000 atm
elementType: 17 8 8 8 7 6 6 6 6 6 6 6 6 6 6 1 1 1 1 1 1 1 1
symmnumber: 1
zpe: 424703.2 jmol-1
zpe.correction: 0.161761 hartree
zpe.thermalcorrener: 0.175637 hartree
zpe.thermalcorrenthalpy: 0.176582 hartree
zpe.thermalcorrgfe: 0.118959 hartree
zpe.sumelectzpe: -1125.284342 hartree
zpe.sumelectthermal: -1125.270466 hartree
zpe.sumelectthermalent: -1125.269522 hartree
zpe.sumelectthermalfe: -1125.327144 hartree
dipole: 1.1651 2.5160 0.0002
dipole: 2.7727
quadrupole: -94.2553 -91.7426 -96.5674
quadrupole: -4.5681 0.0037 -0.0014
quadrupole: -0.0668 2.4458 -2.3790 -4.5681 0.0037 -0.0014
hfenergy: -1125.4461032 hartree
pointgroup: C01 [X(C10H8Cl1N1O3)]
dipole: 0.4506292 -0.9934225 0.0002229 debye
dipolederiv: -1.0827728 0.0600222 -0.0001363 0.1171459 -0.1285948 0.0000333 -0.000152 0.0000254 -0.0639545 -0.6226861 0.0856072 -0.0000511 -0.4655165 -0.8489593 0.0000814 -0.0000066 0.0000812 -0.3453062 -1.2852801 -0.581745 0.0001569 -0.6053064 -0.6329212 0.0001114 0.0008262 0.0006065 -0.4297177 -0.9225491 0.1473082 -0.0000656 0.3311775 -0.9038801 0.0005816 0.0002002 -0.0002757 -0.3294885 -1.2964182 -0.2780885 -0.0000574 -0.3473774 -0.3946512 -0.0000397 0.0000341 -0.0000194 -0.3137793 0.7874278 -0.0120594 0.0000773 -0.181053 -0.0211542 0.0000089 0.0000759 0.0000203 0.0986 -0.0067078 0.0016886 0.0000212 0.0447288 0.0661748 -0.0000727 -0.0000153 -0.0000789 -0.1959559 -0.0817873 0.0005059 0.0000056 -0.0671241 -0.0428856 -0.0000451 0.000024 -0.0000317 -0.1504193 -0.3665062 0.0350795 -0.0000441 0.2803353 0.0358439 -0.0000024 -0.0001139 -0.0000347 -0.0914244 -0.3648509 -0.0167565 -0.0000266 -0.1426705 0.0627325 -0.0000637 0.000028 -0.0000448 -0.0944823 1.4042865 -0.1203563 0.0002069 -0.2167836 0.0669548 -0.0000704 0.0002333 -0.0000555 -0.0814913 1.2724455 0.1780503 0.0000898 0.7654084 1.0607834 -0.0000799 0.0001696 -0.0001319 0.2367691 0.2749611 0.0708088 0.0000905 0.1893882 0.0553566 -0.0000491 -0.0003317 -0.0000663 -0.1459548 -1.0827079 0.0027743 -0.0000302 0.0685193 0.0349342 -0.0000474 -0.0003188 0.0000507 -0.0896767 2.4579283 0.2706749 -0.0001911 -0.1679605 1.2475252 -0.0007107 -0.000371 -0.0003837 0.2491207 0.0231852 0.1062447 -0.0000475 0.0799555 -0.0502937 0.0000764 -0.0000396 0.0000798 0.1698592 0.148147 -0.0503335 0.0000127 -0.0173108 0.0803034 0.000031 -0.0000008 0.0000235 0.1832357 0.1561844 -0.0087129 -0.0000165 0.088963 0.1137263 0.0000587 0.0000017 0.000059 0.3149609 0.0274499 -0.0720856 0.0000059 -0.0719775 0.0145998 0.0000372 0.0000103 0.0000361 0.1661039 0.0549867 0.0499639 -0.0000279 0.0635225 -0.0079212 0.0000579 -0.0000324 0.0000556 0.1611748 0.0578229 -0.0080315 -0.0000222 0.0225936 -0.0460193 0.0000579 -0.0000646 0.000067 0.1715008 0.125658 0.0250661 -0.00002 0.0601055 0.037408 0.0000238 -0.0001675 0.0000377 0.1752331 0.3217832 0.1143744 0.0000697 0.1712367 0.2009377 0.0000217 0.0000108 -0.0000202 0.4050928 unknown
polarizability: 318.4171231|7.8933881|126.49324|0.0217462|-0.0179359|51.5777434 unknown
InChI: InChI=1S/C10H8ClNO3/c11-7-1-3-8(4-2-7)12-9(13)5-6-10(14)15/h1-6,12,14H
charge 0 multiplicity 1
23 atoms
Cl -6.062272 0.253736 -0.000689
O  0.824613 1.61164 -0.000077
O  5.824161 0.756913 -0.000136
O  5.034818 -1.436012 0.00063
N  -0.064469 -0.572846 0.000232
C  -1.462139 -0.321944 0.000006
C  -2.329812 -1.449039 0.000245
C  -2.01391 0.98907 -0.000444
C  -3.727332 -1.280189 0.000039
C  -3.414582 1.156618 -0.000653
C  -4.254392 0.026978 -0.000414
C  0.986695 0.352364 0.000119
C  2.332645 -0.294764 0.000536
C  3.471852 0.450408 0.000652
C  4.801323 -0.201567 0.001166
H  -1.915773 -2.465142 0.000601
H  -1.347677 1.853089 -0.000631
H  0.20497 -1.560098 0.000514
H  -4.392183 -2.148334 0.000226
H  -3.842774 2.163141 -0.001002
H  2.416532 -1.391022 0.000817
H  3.424239 1.543982 0.000404
H  6.706965 0.296515 -0.000639
