program: Gaussian 09
title: 000243232
version: EM64L-G09RevD.01
frameworkgroup: C1[X(C8H9NO)]
method: RPBEPBE
basis: SDD
operation: Freq
keyword: #pfreq=noraman
keyword: PBEPBE/SDD
title: #p freq=noraman PBEPBE/SDD
converged: YES YES NO YES
title: Mulliken charges:
elementType: O N C C C C C C C C H H H H H H H H H
charge: -0.297567 -0.013381 -0.130435 -0.124494 -0.237520 -0.177995 -0.529083 -0.117224 -0.491752 -0.201267 0.256590 0.252074 0.276463 0.258580 0.242954 0.280388 0.266025 0.262631 0.225015
chargesum: 0.00000
title: Mulliken charges with hydrogens summed into heavy atoms:
elementType: O N C C C C C C C C
charge: -0.297567 -0.013381 0.126154 0.127579 0.038943 0.080585 -0.005742 0.148801 -0.004106 -0.201267
polarizability: 1.01931496e+02 -2.72621072e+00 7.43946520e+01 3.51299204e+00 -3.45306654e-01 6.88242057e+01
1716.lowfreq: -22.5581 -8.4454 -0.0006 -0.0005 0.0004 19.1697 92.5185 141.8978 261.1943
frequency: 92.4126 141.8825 261.1937 302.2362 343.8788 429.8563 431.8352 525.1772 547.4201 622.3062 735.6497 758.5267 768.4696 808.2701 818.6518 871.6784 886.9631 914.1632 918.9181 930.0825 976.3231 990.3131 1000.6397 1019.6890 1032.0276 1069.5365 1115.6416 1132.9726 1146.9981 1167.9408 1197.0576 1230.4348 1251.7730 1260.8357 1276.5484 1277.9546 1303.5218 1316.8155 1347.5460 1461.4774 1477.0614 2188.5159 3007.6950 3024.7188 3047.1477 3087.2565 3093.1209 3102.9796 3128.1844 3137.0605 3155.4444
redmass: 4.9478 7.1975 3.4749 3.8124 4.0997 9.3328 2.6805 4.3477 4.1108 3.5994 5.0988 5.1404 4.3071 3.0086 2.8913 2.6043 2.2154 2.3262 2.1995 2.8270 1.5894 1.9189 1.4395 1.8971 2.2463 1.5791 1.0773 1.2606 1.7886 1.3455 1.3683 1.3248 1.5609 1.3500 1.6698 1.5363 1.5970 1.5337 2.5267 1.0886 1.0898 12.5363 1.0817 1.0626 1.0627 1.0992 1.0951 1.0914 1.1038 1.0886 1.1003
irintensity: 5.7920 6.6800 0.8852 4.3352 2.2365 0.3929 9.2850 3.6134 2.1991 4.4987 0.3159 0.3894 2.4875 49.4446 0.2217 11.9877 4.1913 0.3703 3.3163 4.2202 10.3281 6.7565 1.5867 2.2612 2.0545 2.8202 0.2435 4.6743 2.6348 2.9862 1.7258 2.2681 3.4900 0.2939 4.4108 3.5598 6.4503 2.9277 6.5487 18.4038 9.2131 19.5128 7.3724 29.6391 15.8328 17.8831 33.3417 10.2097 7.7966 13.8918 19.5883
temp: 298.150 k
press: 1.00000 atm
elementType: 8 7 6 6 6 6 6 6 6 6 1 1 1 1 1 1 1 1 1
symmnumber: 1
zpe: 401555.3 jmol-1
zpe.correction: 0.152944 hartree
zpe.thermalcorrener: 0.160661 hartree
zpe.thermalcorrenthalpy: 0.161605 hartree
zpe.thermalcorrgfe: 0.120536 hartree
zpe.sumelectzpe: -439.414871 hartree
zpe.sumelectthermal: -439.407154 hartree
zpe.sumelectthermalent: -439.406210 hartree
zpe.sumelectthermalfe: -439.447280 hartree
dipole: -1.9657 1.5794 -1.9331
dipole: 3.1773
quadrupole: -84.0365 -55.0870 -54.6308
quadrupole: -1.4124 0.5178 1.1643
quadrupole: -19.4517 9.4977 9.9540 -1.4124 0.5178 1.1643
hfenergy: -439.5678157 hartree
pointgroup: C01 [X(C8H9N1O1)]
dipole: 0.7768193 0.599128 0.7747602 debye
dipolederiv: -0.7790448 0.1841541 0.0341733 0.20747 -0.3143949 -0.0337756 0.1171359 -0.0591142 -0.3955434 -0.3868421 -0.0370504 0.03565 -0.0247084 -0.2281777 0.003248 -0.0654224 -0.014922 -0.2161477 0.3890532 -0.0489108 0.0570719 -0.0741097 0.0663471 -0.026747 0.0733817 -0.1046295 0.2106247 0.3301451 -0.1435617 0.0741328 -0.1054708 0.1668919 0.0113073 0.1036499 0.0884449 0.1916069 0.0308063 0.0064681 -0.0422278 -0.0431465 0.1151971 0.0471247 -0.1101199 0.0914377 0.0009974 0.0036942 0.046549 -0.0497269 0.0026556 0.0655635 -0.070051 -0.065506 -0.1085102 0.0253869 0.0267514 -0.0261791 0.0066336 -0.0079705 -0.0362995 0.001172 0.0251876 -0.0081064 -0.0293175 -0.038113 -0.0208459 -0.0049897 -0.0344482 0.0892526 -0.0290885 -0.0491626 -0.0267849 0.1948188 0.0027436 0.0129426 0.0309848 0.0844307 0.0722871 0.0232879 -0.0085832 0.0391891 0.0999853 0.2886004 0.0584677 0.0391188 0.0700459 -0.086113 0.0091578 0.1719053 0.0255272 -0.0633658 0.0213429 -0.0112691 -0.0212222 -0.0132926 0.0477364 0.0950237 -0.0270645 0.1140851 -0.0382396 0.0313295 -0.0048973 -0.0859308 -0.0124834 0.007856 -0.0637264 -0.102497 -0.0779542 -0.00597 0.0324695 -0.0681607 -0.010045 -0.0608506 -0.0859223 -0.0379163 -0.0195291 -0.0443869 0.0699782 0.0196669 -0.0592098 0.0290243 -0.0565675 -0.0897129 0.076773 0.0360091 0.0910177 0.0452456 -0.040037 0.0377009 -0.1223955 0.0422525 0.0666267 0.0389545 -0.0921409 0.0246288 0.0313455 0.0212787 0.0273857 0.1156713 0.0194713 0.0584617 -0.05225 0.0734144 -0.0322104 0.0168985 0.0326379 -0.011519 -0.0117774 -0.0219043 0.0596318 0.0405167 0.0113737 0.0486369 -0.0748576 -0.0373858 0.1096115 -0.0414063 0.0678077 0.004984 0.0289707 -0.0597304 0.0621845 0.0492849 0.0509028 -0.0516757 -0.0327393 -0.0391811 0.0197844 -0.0619814 -0.012302 -0.1085332 -0.1127311 unknown
polarizability: 101.9591107|2.4236412|74.3359608|3.6385666|0.4352823|68.8552821 unknown
InChI: InChI=1S/C8H9NO/c9-3-5-1-4-2-6(5)8-7(4)10-8/h4-8H,1-2H2
charge 0 multiplicity 1
19 atoms
O  2.609864 -0.667118 -0.149828
N  -3.484987 -0.319531 -0.199276
C  1.331408 -0.913033 0.621988
C  1.86165 0.486952 0.491051
C  0.044681 -0.931458 -0.225949
C  0.853446 1.211831 -0.420809
C  0.3863 0.067089 -1.367424
C  -0.968912 -0.076768 0.642681
C  -0.414799 1.407152 0.475899
C  -2.358322 -0.213412 0.18168
H  1.439847 -1.534708 1.51632
H  2.41025 1.011963 1.279052
H  -0.333229 -1.92064 -0.520047
H  1.215355 2.131129 -0.904021
H  -0.497314 0.343908 -1.966439
H  1.185948 -0.301243 -2.025333
H  -0.933554 -0.391879 1.703208
H  -1.155329 2.049914 -0.028202
H  -0.183703 1.858551 1.45655
